{"text_format":"1","workbook":"xlsx","n_sheets":18,"sheets":["Info","BOM","LT3690 PS","PCB Mech","PCB Mech (2)","PIC Load Dump","WakeIn","WakeOut","LED Backlight","Prog","12v Power","3.3v Power","Motor","LIN Xcvr","Ribbon Con","Block Cost","Acoustic","Components"],"not_rendered":{"charts":3,"images":26,"macros":1,"external_links":0,"defined_names":16,"comments":2,"pivot_tables":1},"unopened":[],"bounds":{"document_bytes":16777216,"sheet_cells":100000,"rows_first":2000,"rows_last":500,"rows_between":2000,"halvings":0,"cell_chars":16384,"cell_head_chars":4096},"cells_cut":0,"cells_raw":0,"read":"whole","date_system":"1900"}

{"sheet":"Info","index":0,"n_rows":5,"n_cols":3,"rows_kept":5,"cut":false,"hidden":false,"merged":[]}
[]
[null,"This document applies to these design file versions."]
[]
[null,"Schematic Version","1.2.4"]
[null,"PCB Version","1.2.4"]

{"sheet":"BOM","index":1,"n_rows":127,"n_cols":24,"rows_kept":127,"cut":false,"hidden":false,"merged":[[73,14,73,15],[74,14,74,15]]}
["Subsystem","Manufacturer","Part Number","Qty","T","Designator","Change","Description","Package","T-storage","Est. Cost","Qty","$ Ext.","Source","Length","Width","Height","Depth","Units","Length","Width","Height","Depth","Units"]
["+12v Clean Supply","Cornell Dubilier","AFK475M80D16T-F",{"$f":"1+LEN(F2)-LEN(SUBSTITUTE(F2,\",\",\"\"))","v":1},{"$f":"IF(F2<>\"\",LEFT(F2,1),\"Z\")","v":"C"},"C204",null,"4.7uF, 80v, 20%, Al","CAN SMD-6","-55, +105",0.32500000000000001,100,{"$f":"D2*K2","v":0.32500000000000001},"Digi-Key",{"$f":"VLOOKUP($I2,$A$81:$F$110,2,FALSE)","v":6.3},{"$f":"VLOOKUP($I2,$A$81:$F$110,3, FALSE)","v":6.3},{"$f":"VLOOKUP($I2,$A$81:$F$110,4,FALSE)","v":5.8},{"$f":"VLOOKUP($I2,$A$81:$F$110,5,TRUE)","v":0},"mm",{"$f":"IF(AND($S2<>\"\",O2<>\"\"),O2*VLOOKUP($S2,$A$75:$B$77,2),\"\")","v":0.2480314960629921},{"$f":"IF(AND($S2<>\"\",P2<>\"\"),P2*VLOOKUP($S2,$A$75:$B$77,2),\"\")","v":0.2480314960629921},{"$f":"IF(AND($S2<>\"\",Q2<>\"\"),Q2*VLOOKUP($S2,$A$75:$B$77,2),\"\")","v":0.22834645669291337},{"$f":"IF(AND($S2<>\"\",R2<>\"\"),R2*VLOOKUP($S2,$A$75:$B$77,2),\"\")","v":0},{"$f":"IF(S2<>\"\",IF(S2=$A$77,$A$76,$A$77),\"\")","v":"inch"}]
["+12v Clean Supply","TDK Corp","C1005X7S2A103K",2,"C","C208, C219","v1.3.0","0.01uF, 100v, 10%, Cer","0402T","-55, +125",2.9239999999999999E-2,250,5.8479999999999997E-2,"Digi-Key",1,0.5,0.55000000000000004,0,"mm",3.937007874015748E-2,1.968503937007874E-2,2.1653543307086617E-2,0,"inch"]
["+12v Clean Supply","NXP","BAS16,215",1,"D","D201",null,"215mA, 100v, 250mW","SOT-23","-65, +150",4.752E-2,250,4.752E-2,"Digi-Key",3.04,2.64,1.22,0,"mm",0.11968503937007874,0.10393700787401575,4.8031496062992125E-2,0,"inch"]
["+12v Clean Supply","TI","TPS7A1601DGNR ",1,"I","IC201",null,"12v Low, Power Regulator","MSOP-8","-40, +125",2.6739999999999999,250,2.6739999999999999,"Digi-Key",5,3,1.1000000000000001,0,"mm",0.19685039370078738,0.11811023622047244,4.3307086614173235E-2,0,"inch"]
["+12v Clean Supply","Panasonic","ERJ-2RKF1433X",1,"R","R210",null,"143K, 0.1W, 1%","0402",null,1.3639999999999999E-2,250,1.3639999999999999E-2,"Digi-Key",1,0.5,0.4,0,"mm",3.937007874015748E-2,1.968503937007874E-2,1.5748031496062992E-2,0,"inch"]
["+12v Clean Supply","Panasonic","ERJ-2RKF1582X",1,"R","R211",null,"15.8K, 0.1W, 1%","0402",null,1.3639999999999999E-2,250,1.3639999999999999E-2,"Digi-Key",1,0.5,0.4,0,"mm",3.937007874015748E-2,1.968503937007874E-2,1.5748031496062992E-2,0,"inch"]
["+12v Shutdown","Panasonic","ERJ-2RKF1003X",1,"R","R112",null,"100K, 0.1W, 1%","0402","-55, +125",1.3639999999999999E-2,250,1.3639999999999999E-2,"Digi-Key",1,0.5,0.4,0,"mm",3.937007874015748E-2,1.968503937007874E-2,1.5748031496062992E-2,0,"inch"]
["+12v Supply","TDK Corp","C1608X7R1E684K",1,"C","C209",null,"0.68uF, 25v, 10%, Cer","0603","-55, +125",7.4999999999999997E-2,250,7.4999999999999997E-2,"Digi-Key",1.6,0.8,0.8,0,"mm",6.2992125984251968E-2,3.1496062992125984E-2,3.1496062992125984E-2,0,"inch"]
["+12v Supply","TDK Corp","C5750X7S2A106M",1,"C","C210",null,"10uF, 100v, 20%, Cer","2220","-55, +125",1.41,100,1.41,"Digi-Key",5.7,5,2.5,0,"mm",0.22440944881889766,0.19685039370078738,9.8425196850393692E-2,0,"inch"]
["+12v Supply","Taiyo Yuden","UMK105B7102KV-F",null,"C","C211,C215,C217","OMIT","1000pF, 50v, 10% (OMIT)","0402","-55, +125",7.7999999999999996E-3,250,0,"Digi-Key",1,0.5,0.4,0,"mm",3.937007874015748E-2,1.968503937007874E-2,1.5748031496062992E-2,0,"inch"]
["+12v Supply","Taiyo Yuden","UMK105B7102KV-F",{"$f":"1+LEN(F12)-LEN(SUBSTITUTE(F12,\",\",\"\"))","v":1},"C","C212",null,"1000pF, 50v, 10%","0402","-55, +125",7.7999999999999996E-3,250,7.7999999999999996E-3,"Digi-Key",1,0.5,0.4,0,"mm",3.937007874015748E-2,1.968503937007874E-2,1.5748031496062992E-2,0,"inch"]
["+12v Supply","TDK Corp","C1005X7S1A474K",1,"C","C213",null,"0.47uF, 10v, 10%, Cer","0402","-55, +125",3.5999999999999997E-2,250,3.5999999999999997E-2,"Digi-Key",1,0.5,0.4,0,"mm",3.937007874015748E-2,1.968503937007874E-2,1.5748031496062992E-2,0,"inch"]
["+12v Supply","Johanson Dielectrics","160S41X226KV4E",3,"C","C201,C214,C218",null,"22uF, 16v, 10%, X5R Cer","1210","-55, +85",0.71679999999999999,250,2.1503999999999999,"Digi-Key",3.2,2.44,2.8,0,"mm",0.12598425196850394,9.6062992125984251E-2,0.11023622047244093,0,"inch"]
["+12v Supply","Panasonic","EEE-2AA100UP",1,"C","C216",null,"10uF, 100v, 20%, Alu","CAN SMD-8","-40, +85",0.29108000000000001,250,0.29108000000000001,"Digi-Key",8,8,6.2,0,"mm",0.31496062992125984,0.31496062992125984,0.24409448818897639,0,"inch"]
["+12v Supply","Diode Inc","S3KB-13-F",1,"D","D202","v1.3.0","3A 94V","SMB","-65,_150",0.64090000000000003,250,0.64090000000000003,"Digi-Key",7.1,6.1,2.41,0,"mm",0.27952755905511811,0.24015748031496062,9.4881889763779537E-2,0,"inch"]
["+12v Supply","Linear Tech","LT3690EUFE#PBF",1,"I","IC202",null,"LTC3690 Switching P.S.","26-WFQFN ","-40, +125",6.01,100,6.01,"Digi-Key",6,4,0.74,0,"mm",0.23622047244094488,0.15748031496062992,2.9133858267716535E-2,0,"inch"]
["+12v Supply","Panasonic","ERJ-2RKF1001X",1,"R","R212",null,"1K, 0.1W, 1%","0402","-55, +125",1.3639999999999999E-2,250,1.3639999999999999E-2,"Digi-Key",1,0.5,0.4,0,"mm",3.937007874015748E-2,1.968503937007874E-2,1.5748031496062992E-2,0,"inch"]
["+12v Supply","Panasonic","ERJ-2RKF1003X",1,"R","R213",null,"100K, 0.1W, 1%","0402","-55, +125",1.3639999999999999E-2,250,1.3639999999999999E-2,"Digi-Key",1,0.5,0.4,0,"mm",3.937007874015748E-2,1.968503937007874E-2,1.5748031496062992E-2,0,"inch"]
["+12v Supply","Panasonic","ERJ-2RKF2152X",1,"R","R214",null,"21.5K, 0.1W, 1%","0402",null,1.3639999999999999E-2,250,1.3639999999999999E-2,"Digi-Key",1,0.5,0.4,0,"mm",3.937007874015748E-2,1.968503937007874E-2,1.5748031496062992E-2,0,"inch"]
["+12v Supply","Panasonic","ERJ-2RKF5903X",1,"R","R215","v1.2.4","590K, 0.1W, 1%","0402",null,1.3639999999999999E-2,250,1.3639999999999999E-2,"Digi-Key",1,0.5,0.4,0,"mm",3.937007874015748E-2,1.968503937007874E-2,1.5748031496062992E-2,0,"inch"]
["+12v Supply","Panasonic","ERJ-2RKF7322X",1,"R","R216",null,"73.2K, 0.1W, 1%","0402",null,1.3639999999999999E-2,250,1.3639999999999999E-2,"Digi-Key",1,0.5,0.4,0,"mm",3.937007874015748E-2,1.968503937007874E-2,1.5748031496062992E-2,0,"inch"]
["+12v Supply","Panasonic","ERJ-2RKF3832X",2,"R","R113,R217","v1.3.0","38.3K, 0.1W, 1%","0402",null,1.3639999999999999E-2,250,2.7279999999999999E-2,"Digi-Key",1,0.5,0.4,0,"mm",3.937007874015748E-2,1.968503937007874E-2,1.5748031496062992E-2,0,"inch"]
["+12v Supply","Taiyo Yuden","NS12575T220MN",1,"T","T201",null,"22uH, 31mOhm, 4.05A (5.56A Sat)","NS12575","-40, +125",1.47,100,1.47,"Digi-Key",12.5,12.5,7.5,0,"mm",0.49212598425196852,0.49212598425196852,0.29527559055118108,0,"inch"]
["+12v Supply","Panasonic","ERJ-2RKF3240X",1,"R","R218","v1.2.4","3240R, 0.1W, 1%","0402",null,1.3639999999999999E-2,250,1.3639999999999999E-2,"Digi-Key",1,0.5,0.4,0,"mm",3.937007874015748E-2,1.968503937007874E-2,1.5748031496062992E-2,0,"inch"]
["+12v Supply","Panasonic","ERJ-2RKF3240X",1,"R","R219","v1.2.4","3240R, 0.1W, 1%","0402",null,1.3639999999999999E-2,250,1.3639999999999999E-2,"Digi-Key",1,0.5,0.4,0,"mm",3.937007874015748E-2,1.968503937007874E-2,1.5748031496062992E-2,0,"inch"]
["+12v Supply","Infineon","BTS6163D",1,"I","IC204","v1.2.4","High Side Power Switch","TO-252-5","-40, +150",3.2856000000000001,250,3.2856000000000001,"Digi-Key",9.98,6.5,2.2999999999999998,0,"mm",0.39291338582677166,0.25590551181102361,9.0551181102362197E-2,0,"inch"]
["+12v Supply","Panasonic","ERJ-2RKF1582X",1,"R","R118","v1.2.4","15.8K, 0.1W, 1%","0402",null,1.3639999999999999E-2,250,1.3639999999999999E-2,"Digi-Key",1,0.5,0.4,0,"mm",{"$f":"IF(AND($S28<>\"\",O28<>\"\"),O28*VLOOKUP($S28,$A$75:$B$77,2),\"\")","v":3.937007874015748E-2},{"$f":"IF(AND($S28<>\"\",P28<>\"\"),P28*VLOOKUP($S28,$A$75:$B$77,2),\"\")","v":1.968503937007874E-2},{"$f":"IF(AND($S28<>\"\",Q28<>\"\"),Q28*VLOOKUP($S28,$A$75:$B$77,2),\"\")","v":1.5748031496062992E-2},{"$f":"IF(AND($S28<>\"\",R28<>\"\"),R28*VLOOKUP($S28,$A$75:$B$77,2),\"\")","v":0},{"$f":"IF(S28<>\"\",IF(S28=$A$77,$A$76,$A$77),\"\")","v":"inch"}]
["+12v Supply","Fairchild","MMBT3904",1,"Q","Q102","v1.2.4","NPN, 100 mA, 40v, Beta 100","SOT-23","-55, +150",5.7320000000000003E-2,250,5.7320000000000003E-2,"Digi-Key",3.04,2.64,1.22,0,"mm",0.11968503937007874,0.10393700787401575,4.8031496062992125E-2,0,"inch"]
["+12v Supply","Kemet","C0805V103KCRACTU",1,"C","C220","v1.3.0","0.02uF, 600v, 10%, CER","0805","-55, +125",7.6840000000000006E-2,250,7.6840000000000006E-2,"Digi-Key",2,1.25,1.45,0,"mm",{"$f":"IF(AND($S30<>\"\",O30<>\"\"),O30*VLOOKUP($S30,$A$75:$B$77,2),\"\")","v":7.874015748031496E-2},{"$f":"IF(AND($S30<>\"\",P30<>\"\"),P30*VLOOKUP($S30,$A$75:$B$77,2),\"\")","v":4.9212598425196846E-2},{"$f":"IF(AND($S30<>\"\",Q30<>\"\"),Q30*VLOOKUP($S30,$A$75:$B$77,2),\"\")","v":5.7086614173228342E-2},{"$f":"IF(AND($S30<>\"\",R30<>\"\"),R30*VLOOKUP($S30,$A$75:$B$77,2),\"\")","v":0},{"$f":"IF(S30<>\"\",IF(S30=$A$77,$A$76,$A$77),\"\")","v":"inch"}]
["+12v Supply","Panasonic","ERJ-P06J105V",{"$f":"1+LEN(F31)-LEN(SUBSTITUTE(F31,\",\",\"\"))","v":1},{"$f":"IF(F31<>\"\",LEFT(F31,1),\"Z\")","v":"R"},"R220","V1.3.0","1M, 0.5W, 5%","0805",null,4.9399999999999999E-2,250,4.9399999999999999E-2,"Digi-Key",2,1.25,1.45,0,"mm",7.874015748031496E-2,4.9212598425196846E-2,5.7086614173228342E-2,0,"inch"]
["+3.3v Supply","TDK Corp","C2012X5R1E475K",1,"C","C205",null,"4.7uF, 25v, 10%, Cer","0805","-55, +85",0.09,250,0.09,"Digi-Key",2,1.25,1.45,0,"mm",{"$f":"IF(AND($S32<>\"\",O32<>\"\"),O32*VLOOKUP($S32,$A$75:$B$77,2),\"\")","v":7.874015748031496E-2},{"$f":"IF(AND($S32<>\"\",P32<>\"\"),P32*VLOOKUP($S32,$A$75:$B$77,2),\"\")","v":4.9212598425196846E-2},{"$f":"IF(AND($S32<>\"\",Q32<>\"\"),Q32*VLOOKUP($S32,$A$75:$B$77,2),\"\")","v":5.7086614173228342E-2},{"$f":"IF(AND($S32<>\"\",R32<>\"\"),R32*VLOOKUP($S32,$A$75:$B$77,2),\"\")","v":0},{"$f":"IF(S32<>\"\",IF(S32=$A$77,$A$76,$A$77),\"\")","v":"inch"}]
["+3.3v Supply","TDK Corp","C1005X5R1H471K",1,"C","C206",null,"470pF, 50v","0402","-55, +85",8.9999999999999993E-3,250,8.9999999999999993E-3,"Digi-Key",1,0.5,0.4,0,"mm",3.937007874015748E-2,1.968503937007874E-2,1.5748031496062992E-2,0,"inch"]
["+3.3v Supply","TDK Corp","C2012X5R1E475K",1,"C","C207",null,"4.7uF, 25v, 10%, Cer","0805","-55, +85",0.09,250,0.09,"Digi-Key",2,1.25,1.45,0,"mm",7.874015748031496E-2,4.9212598425196846E-2,5.7086614173228342E-2,0,"inch"]
["+3.3v Supply","Micrel","MIC5205-3.3YM5 TR",1,"I","IC203",null,"3.3v Regulator - 16v input","SOT-23-5","-40, +125",0.57199999999999995,250,0.57199999999999995,"Digi-Key",3.04,3,1.3,0,"mm",0.11968503937007874,0.11811023622047244,5.1181102362204724E-2,0,"inch"]
["Development","Panasonic","LNJ308G8LRA",2,{"$f":"IF(F36<>\"\",LEFT(F36,1),\"Z\")","v":"L"},"LED101,LED102",null,"Green LEDs (-30 to +85) (DEVELOPMENT)","0603","-30, +85",0.13900000000000001,250,{"$f":"D36*K36","v":0.27800000000000002},"Digi-Key",{"$f":"VLOOKUP($I36,$A$81:$F$110,2,FALSE)","v":1.6},{"$f":"VLOOKUP($I36,$A$81:$F$110,3, FALSE)","v":0.8},{"$f":"VLOOKUP($I36,$A$81:$F$110,4,FALSE)","v":0.8},{"$f":"VLOOKUP($I36,$A$81:$F$110,5,TRUE)","v":0},"mm",6.2992125984251968E-2,3.1496062992125984E-2,3.1496062992125984E-2,0,"inch"]
["Development","Panasonic","ERJ-2RKF3400X",2,"R","R109,R110",null,"340R, 0.1W, 1% (DEVELOPMENT)","0402","-55, +125",1.3639999999999999E-2,250,2.7279999999999999E-2,"Digi-Key",1,0.5,0.4,0,"mm",3.937007874015748E-2,1.968503937007874E-2,1.5748031496062992E-2,0,"inch"]
["Keypad","Taiyo Yuden","UMK105B7102KV-F",5,"C","C102,C103,C104,C105,C106",null,"1000pF, 50v, 10%","0402","-55, +125",7.7999999999999996E-3,250,3.9E-2,"Digi-Key",1,0.5,0.4,0,"mm",3.937007874015748E-2,1.968503937007874E-2,1.5748031496062992E-2,0,"inch"]
["Keypad","FCI","SFW8S-2STME1LF",1,"J","J101",null,"8-pin flex cable connector","SFW8S",null,0.59599999999999997,250,0.59599999999999997,"Digi-Key",14.4,3.6,5.3,0,"mm",0.56692913385826771,0.14173228346456693,0.20866141732283464,0,"inch"]
["Keypad","Fairchild","MMBT3904",1,"Q","Q101",null,"NPN, 100 mA, 40v, Beta 100","SOT-23","-55, +150",5.7320000000000003E-2,250,5.7320000000000003E-2,"Digi-Key",3.04,2.64,1.22,0,"mm",0.11968503937007874,0.10393700787401575,4.8031496062992125E-2,0,"inch"]
["Keypad","Panasonic","ERJ-2RKF1582X",1,"R","R101",null,"15.8K, 0.1W, 1%","0402","-55, +125",1.3639999999999999E-2,250,1.3639999999999999E-2,"Digi-Key",1,0.5,0.4,0,"mm",3.937007874015748E-2,1.968503937007874E-2,1.5748031496062992E-2,0,"inch"]
["Keypad","Panasonic","ERJ-2RKF1001X",5,"R","R102,R103,R104,R105,R106",null,"1K, 0.1W, 1%","0402","-55, +125",1.3639999999999999E-2,250,6.8199999999999997E-2,"Digi-Key",1,0.5,0.4,0,"mm",3.937007874015748E-2,1.968503937007874E-2,1.5748031496062992E-2,0,"inch"]
["LIN","TDK Corp","C1608C0G2A221J",1,"C","C303",null,"220pF, 100v, 5%, Cer","0603","-55, +125",3.9E-2,250,3.9E-2,"Digi-Key",1.6,0.8,0.8,0,"mm",6.2992125984251968E-2,3.1496062992125984E-2,3.1496062992125984E-2,0,"inch"]
["LIN","TDK Corp","C1608X7R1H104K",1,"C","C304",null,"0.1uF, 50v, 10%, Cer","0603","-55, +125",1.7999999999999999E-2,250,1.7999999999999999E-2,"Digi-Key",1.6,0.8,0.8,0,"mm",6.2992125984251968E-2,3.1496062992125984E-2,3.1496062992125984E-2,0,"inch"]
["LIN","Infineon","TLE7259-2GU",1,"I","IC303",null,"LIN Transceiver","8-SOIC","-40, +150",1.1047199999999999,100,1.1047199999999999,"Digi-Key",5,6,1.75,0,"mm",0.19685039370078738,0.23622047244094488,6.8897637795275593E-2,0,"inch"]
["LIN","Panasonic","ERJ-2RKF1003X",1,"R","R303",null,"100K, 0.1W, 1%","0402","-55, +125",1.3639999999999999E-2,250,1.3639999999999999E-2,"Digi-Key",1,0.5,0.4,0,"mm",3.937007874015748E-2,1.968503937007874E-2,1.5748031496062992E-2,0,"inch"]
["LIN","Panasonic","ERJ-6GEY0R00V",1,"R","R302/L1 (alternate ferrite)","v1.3.0","0.0R, 0.1W","0805","-55, +126",1.1039999999999999E-2,250,1.1039999999999999E-2,"Digi-Key",2,1.25,1.45,0,"mm",{"$f":"IF(AND($S47<>\"\",O47<>\"\"),O47*VLOOKUP($S47,$A$75:$B$77,2),\"\")","v":7.874015748031496E-2},{"$f":"IF(AND($S47<>\"\",P47<>\"\"),P47*VLOOKUP($S47,$A$75:$B$77,2),\"\")","v":4.9212598425196846E-2},{"$f":"IF(AND($S47<>\"\",Q47<>\"\"),Q47*VLOOKUP($S47,$A$75:$B$77,2),\"\")","v":5.7086614173228342E-2},{"$f":"IF(AND($S47<>\"\",R47<>\"\"),R47*VLOOKUP($S47,$A$75:$B$77,2),\"\")","v":0},{"$f":"IF(S47<>\"\",IF(S47=$A$77,$A$76,$A$77),\"\")","v":"inch"}]
["Micro","TDK Corp","C1608X7R1H104K",1,"C","C101",null,"0.1uF, 50v, 10%, Cer","0603","-55, +125",1.7999999999999999E-2,250,1.7999999999999999E-2,"Digi-Key",1.6,0.8,0.8,0,"mm",6.2992125984251968E-2,3.1496062992125984E-2,3.1496062992125984E-2,0,"inch"]
["Micro","Microchip","PIC18F25K22-E/SO",1,"I","IC101",null,"PIC Microprocessor","SOIC-28","-65, +150",2.08,300,2.08,"Digi-Key",17.899999999999999,10.3,2.65,0,"mm",0.70472440944881887,0.40551181102362205,0.10433070866141732,0,"inch"]
["Micro","Sullins","LPPB032NFSS-RC",1,"J","J102",null,"6-Pin Programming connector","Sullins-6PS",null,0.65451999999999999,250,0.65451999999999999,"Digi-Key",4.21,3.1,4.5,0,"mm",0.16574803149606299,0.12204724409448819,0.17716535433070865,0,"inch"]
["Micro","Panasonic","ERJ-2RKF1000X",1,"R","R107",null,"100R, 0.1W, 1%","0402","-55, +125",1.3639999999999999E-2,250,1.3639999999999999E-2,"Digi-Key",1,0.5,0.4,0,"mm",3.937007874015748E-2,1.968503937007874E-2,1.5748031496062992E-2,0,"inch"]
["Micro","Panasonic","ERJ-2RKF7502X",0,"Z",null,null,"75K, 0.1W, 1%","0402","-55, +125",1.3639999999999999E-2,250,0,"Digi-Key",1,0.5,0.4,0,"mm",3.937007874015748E-2,1.968503937007874E-2,1.5748031496062992E-2,0,"inch"]
["Micro","Panasonic","ERJ-2RKF1003X",4,"R","R114,R115,R116,R117",null,"100K, 0.1W, 1%","0402","-55, +125",1.3639999999999999E-2,250,5.4559999999999997E-2,"Digi-Key",1,0.5,0.4,0,"mm",3.937007874015748E-2,1.968503937007874E-2,1.5748031496062992E-2,0,"inch"]
["Motor","TDK Corp","C1608X7R1H104K",1,"C","C301",null,"0.1uF, 50v, 10%, Cer","0603","-55, +125",1.7999999999999999E-2,250,1.7999999999999999E-2,"Digi-Key",1.6,0.8,0.8,0,"mm",6.2992125984251968E-2,3.1496062992125984E-2,3.1496062992125984E-2,0,"inch"]
["Motor","Infineon","TLE5205-2G",1,"I","IC301",null,"H-Bridge","TO-263","-40, +150",4.9189999999999996,100,4.9189999999999996,"Digi-Key",15,10,4.4000000000000004,0,"mm",0.59055118110236215,0.39370078740157477,0.17322834645669294,0,"inch"]
["Motor","Mabuchi","FC280SC-20150",null,"M","Motor",null,"Motor","MabuchiMotor",null,1.95,100,0,"Kysan",45,24.2,18.3,0,"mm",1.7716535433070866,0.952755905511811,0.72047244094488194,0,"inch"]
["Motor","Panasonic","ERJ-2RKF7502X",{"$f":"1+LEN(F57)-LEN(SUBSTITUTE(F57,\",\",\"\"))","v":1},"R","R301",null,"75K, 0.1W, 1%","0402","-55, +125",1.3639999999999999E-2,250,1.3639999999999999E-2,"Digi-Key",1,0.5,0.4,0,"mm",3.937007874015748E-2,1.968503937007874E-2,1.5748031496062992E-2,0,"inch"]
["Motor","Panasonic","ERJ-2RKF1582X",2,"R","R305,R306",null,"15.8K, 0.1W, 1%","0402",null,1.3639999999999999E-2,250,2.7279999999999999E-2,"Digi-Key",1,0.5,0.4,0,"mm",3.937007874015748E-2,1.968503937007874E-2,1.5748031496062992E-2,0,"inch"]
["Sense","TDK Corp","C1005X7S2A103K",2,"C","C202,C203",null,"0.01uF, 100v, 10%, Cer","0402T","-55, +125",2.9239999999999999E-2,250,5.8479999999999997E-2,"Digi-Key",1,0.5,0.55000000000000004,0,"mm",3.937007874015748E-2,1.968503937007874E-2,2.1653543307086617E-2,0,"inch"]
["Sense","Panasonic","ERJ-2RKF1003X",2,"R","R203,R208",null,"100K, 0.1W, 1%","0402","-55, +125",1.3639999999999999E-2,250,2.7279999999999999E-2,"Digi-Key",1,0.5,0.4,0,"mm",3.937007874015748E-2,1.968503937007874E-2,1.5748031496062992E-2,0,"inch"]
["Sense","Panasonic","ERJ-2RKF8871X",2,"R","R207,R209",null,"8870R, 0.1W, 1%","0402","-55, +125",1.3639999999999999E-2,250,2.7279999999999999E-2,"Digi-Key",1,0.5,0.4,0,"mm",3.937007874015748E-2,1.968503937007874E-2,1.5748031496062992E-2,0,"inch"]
["Wake Out","TDK Corp","C1608X7R1H104K",1,"C","C302",null,"0.1uF, 50v, 10%, Cer","0603","-55, +125",1.7999999999999999E-2,250,1.7999999999999999E-2,"Digi-Key",1.6,0.8,0.8,0,"mm",6.2992125984251968E-2,3.1496062992125984E-2,3.1496062992125984E-2,0,"inch"]
["Wake Out","Infineon","BSP452",1,"I","IC302",null,"High side switch","SOT-223","-40, +150",1.2824,100,1.2824,"Digi-Key",6.5,7,1.7,0,"mm",0.25590551181102361,0.27559055118110237,6.6929133858267709E-2,0,"inch"]
[null,null,null,null,"Z",null,null,null,null,null,null,null,0,null,null,null,null,null,null,"","","","",""]
[null,null,null,null,"Z",null,null,null,null,null,null,null,0,null,null,null,null,null,null,"","","","",""]
[null,null,null,null,"Z",null,null,null,null,null,null,null,0,null,null,null,null,null,null,"","","","",""]
[null,null,null,null,"Z",null,null,null,null,null,null,null,0,null,null,null,null,null,null,"","","","",""]
[null,null,null,null,"Z",null,null,null,null,null,null,null,0,null,null,null,null,null,null,"","","","",""]
[null,null,null,null,{"$f":"IF(F69<>\"\",LEFT(F69,1),\"Z\")","v":"Z"},null,null,null,null,null,null,null,0,null,null,null,null,null,null,"","","","",""]
[null,null,null,null,"Z",null,null,null,null,null,null,null,0,null,null,null,null,null,null,"","","","",""]
[null,null,null,null,"Z"]
[null,null,null,null,null,null,null,null,null,null,null,"Total",{"$f":"SUM(M2:M71)","v":31.08158000000001}]
[]
[null,null,null,null,null,null,null,null,null,null,null,null,null,null,"Max Height",null,9.6519999999999992,null,"mm"]
["Unit Lookup","To alternate",null,null,null,null,null,null,null,null,null,null,null,null,"Max Depth",null,1.5,1.5,"mm"]
["inch",{"$f":"1/B77","v":25.4}]
["mm",{"$f":"1/25.4","v":3.937007874015748E-2}]
[]
[]
["Package","Length","Width","Height","Depth","Units"]
["0402",1,0.5,0.4,null,"mm"]
["0402T",1,0.5,0.55000000000000004,null,"mm"]
["0603",1.6,0.8,0.8,null,"mm"]
["0805",2,1.25,1.45,null,"mm"]
["1206",3.2,1.6,0.7,null,"mm"]
["1210",3.2,2.44,2.8,null,"mm",null,null,null,null,500,"v"]
["2220",5.7,5,2.5,null,"mm",null,null,null,null,1000000,"r"]
["26-WFQFN ",6,4,0.74,null,"mm",null,null,null,null,{"$f":"K86*K86/K87","v":0.25},"w"]
["8-SOIC",5,6,1.75,null,"mm"]
["CAN SMD-4",4,4,5.4,null,"mm"]
["CAN SMD-6",6.3,6.3,5.8,null,"mm"]
["CAN SMD-8",8,8,6.2,null,"mm"]
["CAN SMD-8T",8,8,10.199999999999999,null,"mm"]
["MabuchiMotor",45,24.2,18.3,null,"mm"]
["Mallory",14,14,7.7,6.7,"mm"]
["MSOP-8",5,3,1.1000000000000001,null,"mm"]
["NS12575",12.5,12.5,7.5,null,"mm"]
["SC88A",5,6,1.75,null,"mm"]
["SFW8S",14.4,3.6,5.3,null,"mm"]
["SMB",7.1,6.1,2.41,null,"mm"]
["SMC",2.1,2,5.3,null,"mm"]
["SMD",2.1,2,5.3,null,"mm"]
["SOIC-28",17.899999999999999,10.3,2.65,null,"mm"]
["SOT-223",6.5,7,1.7,null,"mm"]
["SOT-23",3.04,2.64,1.22,null,"mm"]
["SOT-23-5",3.04,3,1.3,null,"mm"]
["Sullins-6PS",4.21,3.1,4.5,null,"mm"]
["TO-252-5",9.98,6.5,2.2999999999999998,null,"mm"]
["TO-263",15,10,4.4000000000000004,null,"mm"]
["Z - Last Row",0,0,0,null,"mm"]
[]
[]
[]
["Row Labels","Sum of Est. Cost"]
["+12v Supply",13.750640000000006]
["+3.3v Supply",0.7609999999999999]
["Keypad",0.68840000000000001]
["LIN",1.17536]
["Micro",2.7934399999999999]
["Motor",6.9142799999999989]
["Sense",5.6520000000000001E-2]
["Wake Out",1.3004]
["(blank)"]
["+12v Shutdown",1.3639999999999999E-2]
["+12v Clean Supply",3.10304]
["Development",0.15264]
["Grand Total",30.709360000000004]

{"sheet":"LT3690 PS","index":2,"n_rows":132,"n_cols":6,"rows_kept":132,"cut":false,"hidden":false,"merged":[]}
["Signal","Value","Units","Notes",null,"Based on LT3690"]
["V-IN",28,"v","Typical V-in"]
["V-IN Max",36,"v","Overload shutdown"]
[]
["V-OUT Target",13,"v"]
["Vin Low",15,"v"]
["RT [R21]",72900,"ohms"]
["R4 (FB to Gnd - R22)",38300,"ohms","R4 is data sheet reference"]
["R3 (Out to FB - R23)",{"$f":"B8*(V_OUT/V_FB-1)","v":584075},"ohms","R3 is data sheet reference"]
[{"$f":"A8 & \" => 1%\"","v":"R4 (FB to Gnd - R22) => 1%"},{"$f":"Resistor((B8))","v":38300},"ohms","Selected Resistor Value"]
[{"$f":"A9 & \" => 1%\"","v":"R3 (Out to FB - R23) => 1%"},{"$f":"Resistor((B9))","v":590000},"ohms","Selected Resistor Value"]
[{"$f":"A7 & \" => 1%\"","v":"RT [R21] => 1%"},{"$f":"Resistor((RT))","v":73200},"ohms","Selected Resistor Value"]
["V-FB",0.8,"v"]
["V-SW",0.37,"v"]
["V-LS",0.12,"v"]
["T-ON(min)",0.25,"usec"]
["T-OFF(min)",0.21,"usec"]
["Fsw(max)",{"$f":"(V_OUT+V_LS)/(0.000001*T_ON*(V_IN-V_SW+V_LS))/1000000","v":1.8911711711711712},"MHz","Highest acceptible frequency"]
["Freq (Select)",{"$f":"VLOOKUP(RT,A33:B47,2)","v":0.3},"MHz","Chosen frequency"]
["DC-min",{"$f":"F_Select*0.000001*T_ON*1000000","v":7.4999999999999997E-2},"% duty cycle"]
["DC-max",{"$f":"1-1000000*F_Select*0.000001*T_OFF","v":0.93700000000000006},"% duty cycle"]
["V-IN(min)",{"$f":"(V_OUT+V_LS)/(1-1000000*F_Select*0.000001*T_OFF)-V_LS+V_SW","v":14.252134471718248},"v by duty cycle"]
["V-IN(max)",{"$f":"(V_OUT+V_LS)/(1000000*F_Select*0.000001*T_ON)-V_LS+V_SW","v":175.18333333333334},"v by duty cycle"]
["I-L(peak)",{"$f":"8+(V_IN_OVERLOAD-V_OUT)/(0.000001*Inductance)*0.000001*T_ON","v":8.1962368037859488},"A"]
["L - Inductor",{"$f":"(V_OUT+V_LS)*0.67/F_Select","v":29.301333333333336},"uHenry","Target Value"]
["Lmin - Inductor (min)",{"$f":"(V_OUT +V_LS)*0.42/F_Select","v":18.367999999999999},"uHenry","Minimum value"]
["I-L(Peak to peak ripple)",{"$f":"(1-10%)*(V_OUT+V_LS)/(B25*F_SW)","v":0.21308757280669821},"A"]
["C-OUT (output cap)",{"$f":"150/(V_OUT*F_SW)","v":6.1012253752345211},"uF","(X5R or X7R ceramic best) or Electrolytic with ESR <= 0.03ohm"]
["C-Soft Start",{"$f":"B28/10000","v":6.1012253752345212E-4},"uF"]
["T-Ramp",{"$f":"B29*0.8/0.000002","v":244.04901500938089},"usec"]
[]
["Rt","MHz"]
[9590,1.5]
[10600,1.4]
[11800,1.3]
[13300,1.2]
[15000,1.1000000000000001]
[17000,1]
[19600,0.9]
[22700,0.8]
[26800,0.7]
[32400,0.6]
[40200,0.5]
[52200,0.4]
[72900,0.3]
[117000,0.2]
[164000,0.15]
[]
[]
[]
[]
[]
["SS","Cout","L"]
[".001uF","10 uF","18 uH"]
[]
[]
[]
[]
[]
[]
[]
[]
[]
[]
[]
[]
[]
[]
[]
[]
[]
[]
[]
[]
[]
[]
[]
[]
[]
[".001uF","10 uF","12 uH"]
[]
[]
[]
[]
[]
[]
[]
[]
[]
[]
[]
[]
[]
[]
[]
[]
[]
[]
[]
[]
[]
[]
[]
[]
[]
[".0001 uF","10 uF","12uH"]
[]
[]
[]
[]
[]
[]
[]
[]
[]
[]
[]
[]
[]
[]
[]
[]
[]
[]
[]
[]
[]
[]
[]
[]
[]
[".001uF","10 uF","27 uH"]

{"sheet":"PCB Mech","index":3,"n_rows":40,"n_cols":15,"rows_kept":40,"cut":false,"hidden":false,"merged":[]}
["Origin for PCB","LL corner",null,"from 5 Oct 2012 email",null,null,null,null,null,null,"Values","mm","Value","in"]
["PCB width",29.9,"mm",null,null,null,null,null,null,null,25.4,"mm",{"$f":"K2/25.4","v":1},"in","test"]
["PCB height",82.6,"mm",null,null,null,null,null,null,null,4.0339999999999998,"mm",{"$f":"K3/25.4","v":0.15881889763779528},"in","Ledge Diameter"]
["Notch to notch width",26.5,"mm"]
["mount hole CL to CL width",16,"mm",null,null,null,null,null,null,null,2.7330000000000001,"mm",{"$f":"K5/25.4","v":0.10759842519685041},"in","Post Diameter"]
["mount hole CL to CL height",75.5,"mm",null,null,null,null,null,null,null,5,"mm",0.19685039370078741,"in","Ramp width"]
["top hole to notch center",18.75,"mm",null,null,null,null,null,null,null,25.637,"mm",1.0093307086614174,"in","lower post to lower diag rib"]
["notch offset",1.5,"mm",null,null,null,null,null,null,null,3.262,"mm",0.12842519685039372,"in",{"$f":"1.139+0.128","v":1.2669999999999999}]
["notch diameter",5.5,"mm",null,null,null,null,null,null,null,23.95,"mm",0.94291338582677164,"in",{"$f":"3.111-M9","v":2.1680866141732285}]
["right edge to mount hole",6.95,"mm"]
["top edge to top mount holes",4.54,"mm",null,null,null,null,null,null,null,12.9,"mm",0.50787401574803159,"in"]
["Verifications"]
["left edge to mount hole",{"$f":"B2-B5-B10","v":6.9499999999999984},"mm"]
["left notch inner x",{"$f":"(B2-B4)/2","v":1.6999999999999993},"mm"]
["right notch innter x",{"$f":"B2-B14","v":28.2},"mm"]
[]
["Hole 1 x (bottom left)",{"$f":"B2/2-B5/2","v":6.9499999999999993}]
["Hole 1 y",{"$f":"B3-B11-B6","v":2.5599999999999881}]
["Hole 2 x (top-left)",{"$f":"B17","v":6.9499999999999993}]
["Hole 2 y",{"$f":"B18+B6","v":78.059999999999988}]
["Hole 3 x (top-right)",{"$f":"B17+B5","v":22.95}]
["Hole 3 y",{"$f":"B20","v":78.059999999999988}]
["Hole 4 x (bottom-right)",{"$f":"B21","v":22.95}]
["Hole 4 y",{"$f":"B18","v":2.5599999999999881}]
["notch 1 x (top-right-upper-origin)",{"$f":"B2-(B2-B4)/2+B9/2","v":30.95}]
["notch 1a y (top offset)",{"$f":"B22-B7+B8/2","v":60.059999999999988}]
["notch 1b y (bottom offset)",{"$f":"B22-B7-B8/2","v":58.559999999999988}]
["notch 2 x",{"$f":"0+(B2-B4)/2-B9/2","v":-1.0500000000000007}]
["notch 2 ya (top offset)",{"$f":"B26","v":60.059999999999988}]
["notch 2 yb (bottom offset)",{"$f":"B27","v":58.559999999999988}]
[]
[{"$f":"A17","v":"Hole 1 x (bottom left)"},{"$f":"\"(\" & B17 & \", \" & B18 &  \")\"","v":"(6.95, 2.55999999999999)"}]
[{"$f":"A19","v":"Hole 2 x (top-left)"},{"$f":"\"(\" & B19 & \", \" & B20 &  \")\"","v":"(6.95, 78.06)"}]
[{"$f":"A21","v":"Hole 3 x (top-right)"},{"$f":"\"(\" & B21 & \", \" & B22 &  \")\"","v":"(22.95, 78.06)"}]
[{"$f":"A23","v":"Hole 4 x (bottom-right)"},{"$f":"\"(\" & B23 & \", \" & B24 &  \")\"","v":"(22.95, 2.55999999999999)"}]
[]
["centerline to notch x",{"$f":"B25-B2/2","v":16}]
["notch center y",{"$f":"B20-B7","v":59.309999999999988}]
["notch lower y",{"$f":"B38-B8/2","v":58.559999999999988}]
["verif top hole to top edge",{"$f":"B3-B20","v":4.5400000000000063}]

{"sheet":"PCB Mech (2)","index":4,"n_rows":40,"n_cols":15,"rows_kept":40,"cut":false,"hidden":false,"merged":[]}
["Origin for PCB","LL corner",null,"from 5 Oct 2012 email",null,null,null,null,null,null,"Values","mm","Value","in"]
["PCB width",27.9,"mm",null,null,null,null,null,null,null,25.4,"mm",{"$f":"K2/25.4","v":1},"in","test"]
["PCB height",80.599999999999994,"mm",null,null,null,null,null,null,null,4.0339999999999998,"mm",{"$f":"K3/25.4","v":0.15881889763779528},"in","Ledge Diameter"]
["Notch to notch width",24.5,"mm"]
["mount hole CL to CL width",16,"mm",null,null,null,null,null,null,null,2.7330000000000001,"mm",{"$f":"K5/25.4","v":0.10759842519685041},"in","Post Diameter"]
["mount hole CL to CL height",75.5,"mm",null,null,null,null,null,null,null,5,"mm",0.19685039370078741,"in","Ramp width"]
["top hole to notch center",18.75,"mm",null,null,null,null,null,null,null,25.637,"mm",1.0093307086614174,"in","lower post to lower diag rib"]
["notch offset",2.5,"mm",null,null,null,null,null,null,null,3.262,"mm",0.12842519685039372,"in",{"$f":"1.139+0.128","v":1.2669999999999999}]
["notch diameter",5.5,"mm",null,null,null,null,null,null,null,23.95,"mm",0.94291338582677164,"in",{"$f":"3.111-M9","v":2.1680866141732285}]
["right edge to mount hole",5.95,"mm"]
["top edge to top mount holes",3.54,"mm",null,null,null,null,null,null,null,12.9,"mm",0.50787401574803159,"in"]
["Verifications"]
["left edge to mount hole",{"$f":"B2-B5-B10","v":5.9499999999999984},"mm"]
["left notch inner x",{"$f":"(B2-B4)/2","v":1.6999999999999993},"mm"]
["right notch innter x",{"$f":"B2-B14","v":26.2},"mm"]
[]
["Hole 1 x (bottom left)",{"$f":"B2/2-B5/2","v":5.9499999999999993}]
["Hole 1 y",{"$f":"B3-B11-B6+1","v":2.5599999999999881}]
["Hole 2 x (top-left)",{"$f":"B17","v":5.9499999999999993}]
["Hole 2 y",{"$f":"B18+B6","v":78.059999999999988}]
["Hole 3 x (top-right)",{"$f":"B17+B5","v":21.95}]
["Hole 3 y",{"$f":"B20","v":78.059999999999988}]
["Hole 4 x (bottom-right)",{"$f":"B21","v":21.95}]
["Hole 4 y",{"$f":"B18","v":2.5599999999999881}]
["notch 1 x (top-right-upper-origin)",{"$f":"B2-(B2-B4)/2+B9/2","v":28.95}]
["notch 1a y (top offset)",{"$f":"B22-B7+B8/2","v":60.559999999999988}]
["notch 1b y (bottom offset)",{"$f":"B22-B7-B8/2","v":58.059999999999988}]
["notch 2 x",{"$f":"0+(B2-B4)/2-B9/2","v":-1.0500000000000007}]
["notch 2 ya (top offset)",{"$f":"B26","v":60.559999999999988}]
["notch 2 yb (bottom offset)",{"$f":"B27","v":58.059999999999988}]
[]
[{"$f":"A17","v":"Hole 1 x (bottom left)"},{"$f":"\"(\" & B17 & \", \" & B18 &  \")\"","v":"(5.95, 2.55999999999999)"}]
[{"$f":"A19","v":"Hole 2 x (top-left)"},{"$f":"\"(\" & B19 & \", \" & B20 &  \")\"","v":"(5.95, 78.06)"}]
[{"$f":"A21","v":"Hole 3 x (top-right)"},{"$f":"\"(\" & B21 & \", \" & B22 &  \")\"","v":"(21.95, 78.06)"}]
[{"$f":"A23","v":"Hole 4 x (bottom-right)"},{"$f":"\"(\" & B23 & \", \" & B24 &  \")\"","v":"(21.95, 2.55999999999999)"}]
[]
["centerline to notch x",{"$f":"B25-B2/2","v":15}]
["notch center y",{"$f":"B20-B7","v":59.309999999999988}]
["notch lower y",{"$f":"B38-B8/2","v":58.059999999999988}]
["verif top hole to top edge",{"$f":"B3-B20","v":2.5400000000000063}]

{"sheet":"PIC Load Dump","index":5,"n_rows":33,"n_cols":14,"rows_kept":33,"cut":false,"hidden":false,"merged":[]}
["Signal","Value","Units","Notes",null,"VDD","DAC Count","DAC V","Equiv Bat"]
["Battery",32,"v",null,null,3.3,0,{"$f":"($F$2*G2/2^5)","v":0},{"$f":"H2*($B$3+$B$4)/$B$4","v":0},null,"Signal","Value","Units","Notes"]
["R16",100000,"ohm",null,null,null,1,0.10312499999999999,{"$f":"H3*($B$3+$B$4)/$B$4","v":1.2657518320180383},null,"R5",100000,"Ohms"]
["R20",8870,"ohm",null,null,null,2,0.20624999999999999,{"$f":"H4*($B$3+$B$4)/$B$4","v":2.5315036640360766},null,"R6",100000,"Ohms"]
["V analog in",{"$f":"B2*B4/(B3+B4)","v":2.6071461375952971},"v",null,null,null,3,0.30937499999999996,3.7972554960541141,null,"V-Level",{"$f":"B6*L4/(L3+L4)","v":1.65},"v"]
["V Ref",3.3,"v",null,null,null,4,0.41249999999999998,5.0630073280721533,null,"I R5-R6",{"$f":"1000*B6/(L3+L4)","v":1.6500000000000001E-2},"mA"]
["A/D",{"$f":"B5/B6*2^12","v":3236.0213877546475},"Counts",null,null,null,5,0.515625,6.3287591600901916]
[null,null,null,null,null,null,6,0.61874999999999991,7.5945109921082281]
["R16 Nearest 1%",{"$f":"Resistor(B3)","v":100000},"ohm",null,null,null,7,0.72187499999999993,8.8602628241262682]
["R20 Nearest 1%",{"$f":"Resistor((B4))","v":8870},"ohm",null,null,null,8,0.82499999999999996,10.126014656144307]
[null,null,null,null,null,null,9,0.92812499999999998,11.391766488162345]
[null,null,null,null,null,null,10,1.03125,12.657518320180383]
[null,null,null,null,null,null,11,1.1343749999999999,13.92327015219842]
[null,null,null,null,null,null,12,1.2374999999999998,15.189021984216456]
[null,null,null,null,null,null,13,1.340625,16.4547738162345]
[null,null,null,null,null,null,14,1.4437499999999999,17.720525648252536]
[null,null,null,null,null,null,15,1.546875,18.986277480270576]
[null,null,null,null,null,null,16,1.65,20.252029312288613]
[null,null,null,null,null,null,17,1.7531249999999998,21.51778114430665]
[null,null,null,null,null,null,18,1.85625,22.78353297632469]
[null,null,null,null,null,null,19,1.9593749999999999,24.04928480834273]
[null,null,null,null,null,null,20,2.0625,25.315036640360766]
[null,null,null,null,null,null,21,2.1656249999999999,26.580788472378806]
[null,null,null,null,null,null,22,2.2687499999999998,27.846540304396839]
[null,null,null,null,null,null,23,2.3718749999999997,29.112292136414879]
[null,null,null,null,null,null,24,2.4749999999999996,30.378043968432912]
[null,null,null,null,null,null,25,2.578125,31.64379580045096]
[null,null,null,null,null,null,26,2.6812499999999999,32.909547632469]
[null,null,null,null,null,null,27,2.7843749999999998,34.175299464487033]
[null,null,null,null,null,null,28,2.8874999999999997,35.441051296505073]
[null,null,null,null,null,null,29,2.9906249999999996,36.706803128523106]
[null,null,null,null,null,null,30,3.09375,37.972554960541153]
[null,null,null,null,null,null,31,3.1968749999999999,39.238306792559186]

{"sheet":"WakeIn","index":6,"n_rows":34,"n_cols":4,"rows_kept":34,"cut":false,"hidden":false,"merged":[]}
["Signal","Value","Units","Notes"]
["Battery",36,"v"]
["R34",9760,"ohm","Parallel resistors to handle the power"]
["R35",{"$f":"B3","v":9760},"ohm"]
["R3",{"$f":"B4","v":9760},"ohm"]
[{"$f":"\"Current \" &A3","v":"Current R34"},{"$f":"$B$2/B3","v":3.6885245901639345E-3},"A"]
[{"$f":"\"Current \" &A4","v":"Current R35"},{"$f":"$B$2/B4","v":3.6885245901639345E-3},"A"]
[{"$f":"\"Current \" &A5","v":"Current R3"},{"$f":"$B$2/B5","v":3.6885245901639345E-3},"A"]
[{"$f":"\"Power \" &A3","v":"Power R34"},{"$f":"$B$2*B6","v":0.13278688524590165},"W","0.25W components"]
[{"$f":"\"Power \" &A4","v":"Power R35"},{"$f":"$B$2*B7","v":0.13278688524590165},"W"]
[{"$f":"\"Power \" &A5","v":"Power R3"},{"$f":"$B$2*B8","v":0.13278688524590165},"W"]
[]
["Battery (low)",12,"v"]
["Load",{"$f":"1/(1/B3+1/B4+1/B5)","v":3253.3333333333335},"ohm"]
["WakeIn current",{"$f":"B13/B14","v":3.6885245901639341E-3},"a"]
[]
["Battery (low)",28,"v"]
["Load",{"$f":"1/(1/B3+1/B4+1/B5)","v":3253.3333333333335},"ohm"]
["WakeIn current",{"$f":"B17/B18","v":8.6065573770491791E-3},"a"]
["Power",{"$f":"B17^2/B3","v":8.0327868852459017E-2}]
[]
[]
["R16 Nearest 1%",{"$f":"Resistor(B3)","v":9760},"ohm"]
["R20 Nearest 1%",{"$f":"Resistor(B4)","v":9760},"ohm"]
[]
[]
[]
[]
[]
[]
[]
[]
[]
[null,null,null,"JD Requirement - 4 mA @ 12v for contact cleaning"]

{"sheet":"WakeOut","index":7,"n_rows":24,"n_cols":22,"rows_kept":24,"cut":false,"hidden":false,"merged":[]}
["Subsystem","Manufacturer","Part Number","Qty","Designator","Description","Package","T-storage","Est. Cost","Qty","$ Ext.","Source","Length","Width","Height","Depth","Units","Length","Width","Height","Depth","Units"]
[]
["Wake Out","Infineon","BSP452",{"$f":"1+LEN(E3)-LEN(SUBSTITUTE(E3,\",\",\"\"))","v":1},"IC6","High side switch","SOT-223",null,1.4280999999999999,100,{"$f":"D3*I3","v":1.4280999999999999},"Digi-Key",6.5,7,1.7,null,"mm",{"$f":"IF(AND($Q3<>\"\",M3<>\"\"),M3*VLOOKUP($Q3,$A$67:$B$69,2),\"\")","v":{"$error":"#N/A"}},{"$f":"IF(AND($Q3<>\"\",N3<>\"\"),N3*VLOOKUP($Q3,$A$67:$B$69,2),\"\")","v":{"$error":"#N/A"}},{"$f":"IF(AND($Q3<>\"\",O3<>\"\"),O3*VLOOKUP($Q3,$A$67:$B$69,2),\"\")","v":{"$error":"#N/A"}},{"$f":"IF(AND($Q3<>\"\",P3<>\"\"),P3*VLOOKUP($Q3,$A$67:$B$69,2),\"\")","v":""},{"$f":"IF(Q3<>\"\",IF(Q3=$A$69,$A$68,$A$69),\"\")","v":0}]
[]
["Wake Out","Infineon","BTS4140N",{"$f":"1+LEN(E5)-LEN(SUBSTITUTE(E5,\",\",\"\"))","v":1},"IC6","high side driver","SOT-223",null,0.93440000000000001,100,{"$f":"D5*I5","v":0.93440000000000001},"Digi-Key"]
["Wake Out","Infineon","BSS123 L6327",{"$f":"1+LEN(E6)-LEN(SUBSTITUTE(E6,\",\",\"\"))","v":1},null,"N-channel mosfet","SOT-23",null,0.1512,100,{"$f":"D6*I6","v":0.1512},"Digi-Key"]
[]
[]
[]
[]
[]
[]
[]
[]
[]
[]
[]
[]
[]
[]
[]
["Vout",{"$f":"1.242*(B24/B23+1)","v":11.854025316455695}]
["R1",{"$f":"Resistor(15800)","v":15800}]
["R2",135000]

{"sheet":"LED Backlight","index":8,"n_rows":35,"n_cols":5,"rows_kept":35,"cut":false,"hidden":false,"merged":[]}
["LED Load Description","Value","Units",null,"Notes"]
["LED Voltage Drop max",3.1,"v"]
["LED Voltage Drop min",2.7,"v"]
["LED Max Current (at 3.1v)",5.0000000000000001E-3,"A"]
["# LEDs in Series",2,"pc"]
["# Parallel strings",2,"count"]
["Voltage - Minimum",12,"v"]
[]
["Resistance - Series",{"$f":"Resistor((B7-B5*B2)/B4)","v":1150},"ohm"]
["LED Max Current (at 2.7v)",{"$f":"(B7-B5*B3)/B9","v":5.7391304347826086E-3},"A"]
["Keypad Current at Vmin",{"$f":"B$6*(B7-B$5*B$2)/B$9","v":1.008695652173913E-2},"A"]
["Keypad Current at LED min V",{"$f":"B6*B10","v":1.1478260869565217E-2},"A"]
["Current Limit Power Diss",{"$f":"(B7-B3)*B10","v":5.3373913043478265E-2},"W"]
[]
["LED Driver","Value","Units"]
["Q2 collector current",{"$f":"B12","v":1.1478260869565217E-2},"A"]
["Q2 DC current gain",72,"hFE"]
["Q2 Base Drive",{"$f":"B16/B17","v":1.5942028985507247E-4},"A"]
["Q2 Vbe",0.6,"v"]
["Port Pin Vout High",3.1,"v"]
["R Base Drive resistor",{"$f":"(B20-B19)/B18","v":15681.818181818182},"ohm"]
["Nearest 1% value",{"$f":"Resistor((B21))","v":15800},"ohm"]
["R Power dissipation",{"$f":"(B20-B19)*B18","v":3.9855072463768114E-4},"W"]
[]
[]
[]
[]
[]
["Development LEDs","Value","Units"]
["LED Drive voltage",3.3,"v"]
["LED voltage drop max",2.4,"v"]
["LED drive current",5.0000000000000001E-3,"A"]
["Series Resistor",{"$f":"(B30-B31)/B32","v":179.99999999999997},"ohm"]
["Nearest 1% value",{"$f":"Resistor(B33)","v":178},"ohm"]
["Resistor Power dissipation",{"$f":"(B30-B31)*B32","v":4.4999999999999997E-3},"W"]

{"sheet":"Prog","index":9,"n_rows":4,"n_cols":3,"rows_kept":4,"cut":false,"hidden":false,"merged":[]}
["Reset protection","Value","Units"]
["Series Resistor",100,"ohm"]
["Max voltage diff",5,"v"]
["Resistor Power Diss",{"$f":"B3^2/B2","v":0.25},"W"]

{"sheet":"12v Power","index":10,"n_rows":23,"n_cols":8,"rows_kept":23,"cut":false,"hidden":false,"merged":[]}
["Signal","Value","Units","Notes",null,"Value","Units","Notes"]
["V-IN",28,"v",null,null,34,"v","Controlled shutdown"]
["V-OUT",12,"v",null,null,12,"v"]
["R1",{"$f":"Resistor(B5*(B3/1.193-1))","v":143000},"ohm"]
["R2",{"$f":"Resistor(15800)","v":15800},"ohm"]
["Current - R1,R2",{"$f":"B3/(B4+B5) *1000","v":7.5566750629722915E-2},"mA"]
[]
["12v Loads","Value","Units","Notes",null,"Value","Units","Notes"]
["Quiescient Current",2.5000000000000001E-2,"mA",null,null,2.5000000000000001E-2,"mA"]
["LIN",{"$f":"1000*'LIN Xcvr'!B12","v":17},"mA","27 mA as master",null,0.03,"mA","No transmit"]
["Acoustic Signal",5,"mA",null,null,0,"mA","Signal Off"]
["Backlight LEDs",{"$f":"1000*'LED Backlight'!B16","v":11.478260869565217},"mA","from LED Sheet",null,{"$f":"0.5*B12","v":5.7391304347826084},"mA"]
["3.3v Supply",{"$f":"'3.3v Power'!B38","v":21.514891352549892},"mA","from 3.3v Power sheet",null,{"$f":"'3.3v Power'!E38","v":5.1898891352549885},"mA","Includes all loads"]
["Total",{"$f":"SUM(B9:B13)","v":55.018152222115106},"mA",null,null,{"$f":"SUM(F9:F13)","v":10.984019570037596},"mA"]
[]
["Operating Junction Limit",125,"°C","Component Limit"]
["Power Dissipation",{"$f":"(B2-B3)*B14/1000","v":0.88029043555384168},"W",null,null,{"$f":"(F2-F3)*F14/1000","v":0.24164843054082713},"W"]
[]
["Temp Junct to Board",34,"°C / W",null,null,34,"°C / W"]
[]
["Temp Rise",{"$f":"B17*B19","v":29.929874808830618},"°C",null,null,{"$f":"F17*F19","v":8.2160466383881232},"°C"]
["Ambient",85,"°C",null,null,85,"°C"]
["Junction Temp",{"$f":"SUM(B21:B22)","v":114.92987480883062},"°C",null,null,{"$f":"SUM(F21:F22)","v":93.216046638388121},"°C"]

{"sheet":"3.3v Power","index":11,"n_rows":38,"n_cols":7,"rows_kept":38,"cut":false,"hidden":false,"merged":[]}
["Description","Value","Units","Notes"]
["LM2936DT-3.3",3.3,"v","regulated output voltage, 50 mA max. -50, +60"]
[]
["V Battery min",9,"v"]
["V Battery max operating",32,"v","max operating (does not subtract reverse diode"]
["V Battery max",36,"v","auto-sleep"]
[]
["I Load min",0.5,"mA"]
["I Load max operating",{"$f":"B31","v":10},"mA","Average current"]
["I Load max",2,"mA"]
[]
["Power dissipation min",{"$f":"(B4-$B$2)*B8","v":2.85},"mW"]
["Power dissipation max oper.",{"$f":"(B5-$B$2)*B9","v":287},"mW","max operating"]
["Power dissipation max",{"$f":"(B6-$B$2)*B10","v":65.400000000000006},"mW","Linear regulator dissipation"]
[]
["Ambient temp nominal",25,"°C"]
["Ambient temp max",85,"°C"]
["Temp Rise J-A",140,"°C / W","Component spec"]
["Calc. Temp Rise",{"$f":"B18*B13/1000","v":40.18},"°C"]
["Calc. Temp max oper",{"$f":"B17+B19","v":125.18},"°C","Spec is 150°C, with power diss internally limited"]
[]
["Diode Drop",1,"v","Reverse Protection"]
["Current",0.05,"A"]
["Diode Power",{"$f":"1000*B22*B23","v":50},"mW"]
[]
["Development LED Voltage",1.6,"v"]
["Target Current",5,"mA"]
["Nearest 1% resistor",{"$f":"Resistor((B2-B26)/(B27/1000))","v":340},"ohm"]
[]
["Current Requirements","Value","Units","Notes","Value","Units","Notes"]
["PIC",10,"mA","Cranking hard",4,"mA","gentle snooze"]
["LED Driver",{"$f":"1000*(B2-0.6)/2050","v":1.3170731707317072},"mA","100% on",{"$f":"0.1 *1000*(B2-0.6)/2050","v":0.13170731707317074},"mA","10% on"]
["Acoustic Driver",{"$f":"1000*(B2-0.6)/33000","v":8.1818181818181804E-2},"mA","100% on",{"$f":"0.1 * 1000*(B2-0.6)/33000","v":8.1818181818181825E-3},"mA","10% on"]
["Test Point LEDs (2)",{"$f":"2*B27","v":10},"mA","both on",{"$f":"0.1 * 2*B27","v":1},"mA","10% on"]
["HV Enable",{"$f":"1000*B2/100000","v":3.3000000000000002E-2},"mA","hv on",{"$f":"1000*E2/100000","v":0},"mA","hv off"]
["Quiescient Current",0.05,"mA","regulator internal",0.05,"mA","regulator internal"]
["LIN RxD",{"$f":"1000*B2/100000","v":3.3000000000000002E-2},"mA","normal",{"$f":"1000*E2/100000","v":0},"mA","sleep"]
["Total",{"$f":"SUM(B31:B37)","v":21.514891352549892},"mA",null,{"$f":"SUM(E31:E37)","v":5.1898891352549885},"mA"]

{"sheet":"Motor","index":12,"n_rows":29,"n_cols":4,"rows_kept":29,"cut":false,"hidden":false,"merged":[]}
["Description","Value","Units","Notes"]
["Min Voltage",9,"V","Assumes the motor is rated to operate at this minimum voltage"]
["Motor Current @Min V",5,"A","And current"]
["Power Min",{"$f":"B2*B3","v":45},"W"]
[]
["Voltage 1",12,"V"]
["Motor Current @V1",{"$f":"B$3 * B6/B$2","v":6.666666666666667},"A"]
["Power 1",{"$f":"B6*B7","v":80},"W"]
[]
["Voltage 2",24,"V"]
["Motor Current @V2",{"$f":"B$3 * B10/B$2","v":13.333333333333334},"A"]
["Power 2",{"$f":"B10*B11","v":320},"W"]
[]
["Voltage 2",32,"V"]
["Motor Current @V2",{"$f":"B$3 * B14/B$2","v":17.777777777777779},"A"]
["Power 3",{"$f":"B14*B15","v":568.88888888888891},"W"]
[]
["Error Flag Behavior","Value","Units","Description"]
["Vcc",3.3,"v"]
["EF leakage",10,"uA"]
["Nominal equiv R",{"$f":"B19/(B20*0.000001)","v":330000},"ohm"]
["Pullup",{"$f":"Resistor(75000)","v":75000},"ohm"]
["EF V leakage",{"$f":"B19*B21/(B22+B21)","v":2.6888888888888891},"bill25"]
[]
["PIC Input High (TTL)",2,"v"]
["PIC Input High (TTL2)",{"$f":"0.8+0.25*B19","v":1.625},"v"]
["PIC Input High (Schmitt)",{"$f":"0.8*B19","v":2.64},"v"]
["PIC Input High (I2C)",{"$f":"0.7*B19","v":2.3099999999999996},"v"]
["PIC Input High (SMBus)",2.1,"v"]

{"sheet":"LIN Xcvr","index":13,"n_rows":18,"n_cols":3,"rows_kept":18,"cut":false,"hidden":false,"merged":[]}
["Vendor","Part #","LIN V"]
["Infineon","TLE7259-2GE",2]
[]
[]
["LIN Master","Value","Units"]
["LIN MASTER",1,"True/False"]
["Vsupply",12,"v"]
["Resistor",{"$f":"IF(B6,1000,1000000)","v":1000},"ohm"]
["Current - short crkt",{"$f":"B7/B8","v":1.2E-2},"A"]
["Power Dis",{"$f":"(B7-0.6)*B9","v":0.1368},"W"]
["Chip Oper Cur",5.0000000000000001E-3,"A"]
["Total Current",{"$f":"B7/B8+B11","v":1.7000000000000001E-2},"A"]
[]
["LIN Master","Value","Units"]
["Nuber Resistors",2,"count"]
["Resistance",{"$f":"B15*B8","v":2000},"ohm"]
["Current - short",{"$f":"B7/B16","v":6.0000000000000001E-3},"A"]
["Power",{"$f":"B7*B17","v":7.2000000000000008E-2},"W"]

{"sheet":"Ribbon Con","index":14,"n_rows":30,"n_cols":4,"rows_kept":30,"cut":false,"hidden":false,"merged":[]}
["Pin","X","Y","Units"]
[1,{"$f":"-2.5-1.25/2","v":-3.125},1,"mm"]
[2,{"$f":"(A3-A$2)*1.25+B$2","v":-1.875},{"$f":"C2-2","v":-1},"mm"]
[3,{"$f":"(A4-A$2)*1.25+B$2","v":-0.625},{"$f":"C2","v":1},"mm"]
[4,{"$f":"(A5-A$2)*1.25+B$2","v":0.625},{"$f":"C3","v":-1},"mm"]
[5,{"$f":"(A6-A$2)*1.25+B$2","v":1.875},{"$f":"C4","v":1},"mm"]
[6,{"$f":"(A7-A$2)*1.25+B$2","v":3.125},{"$f":"C5","v":-1},"mm"]
[]
["Housing Left",{"$f":"-13.25/2","v":-6.625}]
["Housing Right",{"$f":"-B9","v":6.625}]
["Slot Left",{"$f":"-8.95/2","v":-4.4749999999999996}]
["Slot Right",{"$f":"-B11","v":4.4749999999999996}]
[]
[]
[]
["Pin","X","Y","Units"]
[1,-1.25,1,"mm"]
[2,{"$f":"(A18-A$17)*1.25+B$17","v":0},{"$f":"C17-2","v":-1},"mm"]
[3,{"$f":"(A19-A$17)*1.25+B$17","v":1.25},{"$f":"C17","v":1},"mm"]
[]
[]
["Housing Left",{"$f":"-9.5/2","v":-4.75}]
["Housing Right",{"$f":"-B22","v":4.75}]
["Slot Left",{"$f":"-5.2/2","v":-2.6}]
["Slot Right",{"$f":"-B24","v":2.6}]
[]
[null,84.86,"mm"]
[null,{"$f":"B27/25.4","v":3.3409448818897638}]
[null,21.79,"mm"]
[null,{"$f":"B29/25.4","v":0.85787401574803146}]

{"sheet":"Block Cost","index":15,"n_rows":27,"n_cols":5,"rows_kept":27,"cut":false,"hidden":false,"merged":[]}
["Functional Block","Est. Cost","Qty",null,"Notes"]
["Micro",4.5,2000,null,"micro, crystal, caps"]
["Config Storage",0.25,2000,null,"eerom"]
["Power Supply",4,2000,null,"switching"]
["Learn Mode",0.1,2000,null,"2xR, 1xC"]
["Wakeup In",0.25,2000]
["Wakeup Out",1,2000]
["LIN Transceiver",1,2000]
["CAN Transceiver",1,2000,null,"xcvr, filter, diodes"]
["H-Driver",3.75,2000]
["LED Driver",0.1,2000]
["Keypad Sense",0.25,2000]
["Acoustic Signal",2.25,2000,null,"need to find -40 to +85 part"]
["Miscellaneous",3,2000,null,"whatever was forgotton above"]
["Estimated Total",{"$f":"SUM(B2:B14)","v":21.45}]
[]
[]
[]
["Estimated costs includes the primary and supporting components"]
[]
[]
[]
[]
[null,"LIN","CAN","JD Exclusive","Description"]
[null,"Yes","No","No","smaller micro, no JD/OS"]
[null,"No","Yes","Yes","JD/OS, \"fully integrated\""]
[null,"No","Yes","No","powerful micro, ~25-50,000 lines of code"]

{"sheet":"Acoustic","index":16,"n_rows":20,"n_cols":6,"rows_kept":20,"cut":false,"hidden":false,"merged":[]}
["Acoustic Signal"]
["4khz - http://www.soundsnap.com/search/audio/4khz/popular"]
["2khz - http://www.soundsnap.com/search/audio/2khz/popular"]
[]
["Manufacturer","Freq","Temp Range","$ ea","$ @500","Web"]
[]
["CUI Inc (smd)","4 khz","'-30 + 70","$4.81 qty 1","$2.49 qty 500","http://search.digikey.com/us/en/products/CMI-1240/102-1196-5-ND/504829"]
["CUI Inc (thru hole)","4 khz","'-20 +70","$3.19 qty 1","$1.65 qty 500","http://search.digikey.com/us/en/products/CEP-2242/102-1115-ND/412374"]
["PUI Audio (thru hole)","4 khz","'-20 +70","$3.66 qty 1","$2.20 qty 500","http://search.digikey.com/us/en/products/AI-1440-TWT-12V-R/668-1024-ND/1464763"]
["Mallory (thru hole)","4.1 khz","'-20 + 90","$2.43 qty 1","$2.09 qty 500","http://search.digikey.com/us/en/products/PK-12N40PQ/458-1066-ND/969793"]
["Kobiton (thru hole)","4 khz","'-20 + 105","$4.26 qty 1","$2.59 qty 500","http://www.mouser.com/ProductDetail/Kobitone/254-15210-ROX/?qs=05UEgX2TgG1gFl%2faATOCEw%3d%3d"]
[]
[]
[]
["Acoustic Supply",12,"v"]
["Acoustic Current",5.0000000000000001E-3,"A"]
["Driver gain (min)",50]
["Base Drive Current",{"$f":"B16/B17","v":1E-4},"A"]
["Base Drive Voltage",3.3,"v"]
["Base Drive Resistance",{"$f":"B19/B18","v":33000}]

{"sheet":"Components","index":17,"n_rows":46,"n_cols":4,"rows_kept":46,"cut":false,"hidden":false,"merged":[]}
["Category","ScratchNotes","Additional Notes"]
["H-Bridge","BTN7960/70/71","half-Bridge 40V 40A","requires 2 part"]
["H-Bridge","TLE6208-3","3 half-bridge .8A 32v","0.8A not enough"]
["H-Bridge","TLE8201R","Full Door module - Mirror w/heat/light","too many functions - cost"]
["H-Bridge","TLE8203E","Full Door module - Mirror w/heat/light","not enough current"]
["H-Bridge","TLE84106EL","Hex half-bridge","18v, 0.8A"]
["H-Bridge","TLE7181EM","H-Bridge Driver: 34v, 10 uA quiescient, lots of features (may cost too much)","Pre-Driver for mosfets"]
["H-Bridge","BTM7740G","8A peak (25C), 5uA quiesc, 40V"]
["H-Bridge","TLE5205","4A 40V status"]
["H-Bridge","TLE5206","4A 40V status"]
[]
[null,"BTS50015","Single high-side 28V 33A, 18uA standby","If we need a pre-enable"]
[]
["System Basis Chip","TLE8261E","System Basis Chip, reg, CAN transceiver, watchdog","very interesting combination of parts, but for a system that does not need them all, this is overkill and no alternate sourcing."]
["System Basis Chip","TLE8262E","1xLIN"]
["System Basis Chip","TLE8263E","2xLIN"]
["System Basis Chip","TLE8264E","3xLIN"]
["System Basis Chip","TLE6266G","CAN, Watchdog","on special request only"]
["Window Lift Module","TLE7810","Full Window Control on LIN w/8051"]
[]
[]
["Power Supply","TLE6365G","step down w/reset 8 to 40v","no enable"]
["Power Supply","TLE6711G","boost/buck, watchdog, enable","watchdog compatibility"]
["Power Supply","TLE7368E","5.5v, reset, watchdog","overkill - for high end multi-voltage"]
["Power Supply","TLE4278G","Reset, watchdog","linear part, but with possibly adequate heat-sink"]
["Power Supply","LTC3115-1","buck-boost, 2.7-40v, 5v1A out, enable, burst mode"]
["Power Supply","LT3433","buck-boost, 4-60v, 5v .3A, enable"]
["Power Supply","LT3689","step-down, por, wdt","wdt compatibility?"]
["Power Supply","LT3682","uPower step down,"]
["Power Supply","LT3631","4.5 to 45 to 5v@100mA","nice, but 100mA max"]
["Power Supply","LT3470A","buck reg 12v to 5v@250mA","8-pin"]
["Power Supply","LTM8021","7.5-36v to 5v@500mA","full uModule w most parts (LGA pkg)"]
["Power Supply","LT3502","7-40v to 5v@500mA"]
["Power Supply","LT3970","7-40 to 5v@350mA, enable, power good out","10-pin"]
["Power Supply","LT1934ES6","6.5-34v to 5v@250mA, enable","6-pin"]
[]
[]
[]
["Capacitive Touch Sense",null,"Can share matrix with backlight LEDs"]
[]
[]
["Key","Not yet analyzed","part identified from initial scan/research"]
[null,"Candidate Parts","looks even better"]
[null,"Candidate Parts","seems to mee the requirements"]
[null,"Defer rejection","further analysis may be required"]
[null,"Rejected","not appropriate for this project (reason noted)"]