{"text_format":"1","workbook":"xlsx","n_sheets":17,"sheets":["Info","BOM","LT3690 PS","PCB Mech","PIC Load Dump","WakeIn","WakeOut","LED Backlight","Prog","12v Power","3.3v Power","Motor","LIN Xcvr","Ribbon Con","Block Cost","Acoustic","Components"],"not_rendered":{"charts":3,"images":26,"macros":1,"external_links":0,"defined_names":16,"comments":2,"pivot_tables":1},"unopened":[],"bounds":{"document_bytes":16777216,"sheet_cells":100000,"rows_first":2000,"rows_last":500,"rows_between":2000,"halvings":0,"cell_chars":16384,"cell_head_chars":4096},"cells_cut":0,"cells_raw":0,"read":"whole","date_system":"1900"}

{"sheet":"Info","index":0,"n_rows":5,"n_cols":3,"rows_kept":5,"cut":false,"hidden":false,"merged":[]}
[]
[null,"This document applies to these design file versions."]
[]
[null,"Schematic Version","1.2.2"]
[null,"PCB Version","1.2.1"]

{"sheet":"BOM","index":1,"n_rows":120,"n_cols":23,"rows_kept":120,"cut":false,"hidden":false,"merged":[[65,13,65,14],[66,13,66,14]]}
["Subsystem","Manufacturer","Part Number","Qty","T","Designator","Description","Package","T-storage","Est. Cost","Qty","$ Ext.","Source","Length","Width","Height","Depth","Units","Length","Width","Height","Depth","Units"]
["Keypad","Taiyo Yuden","UMK105B7102KV-F",{"$f":"1+LEN(F2)-LEN(SUBSTITUTE(F2,\",\",\"\"))","v":5},{"$f":"IF(F2<>\"\",LEFT(F2,1),\"Z\")","v":"C"},"C102,C103,C104,C105,C106","1000pF, 50v, 10%","0402","-55, +125",7.7999999999999996E-3,250,{"$f":"D2*J2","v":3.9E-2},"Digi-Key",{"$f":"VLOOKUP($H2,$A$73:$G$101,2,FALSE)","v":1},{"$f":"VLOOKUP($H2,$A$73:$G$101,3, FALSE)","v":0.5},{"$f":"VLOOKUP($H2,$A$73:$G$101,4,FALSE)","v":0.4},{"$f":"VLOOKUP($H2,$A$73:$G$101,5,TRUE)","v":0},"mm",{"$f":"IF(AND($R2<>\"\",N2<>\"\"),N2*VLOOKUP($R2,$A$67:$B$69,2),\"\")","v":3.937007874015748E-2},{"$f":"IF(AND($R2<>\"\",O2<>\"\"),O2*VLOOKUP($R2,$A$67:$B$69,2),\"\")","v":1.968503937007874E-2},{"$f":"IF(AND($R2<>\"\",P2<>\"\"),P2*VLOOKUP($R2,$A$67:$B$69,2),\"\")","v":1.5748031496062992E-2},{"$f":"IF(AND($R2<>\"\",Q2<>\"\"),Q2*VLOOKUP($R2,$A$67:$B$69,2),\"\")","v":0},{"$f":"IF(R2<>\"\",IF(R2=$A$69,$A$68,$A$69),\"\")","v":"inch"}]
["Micro","TDK Corp","C1608X7R1H104K",{"$f":"1+LEN(F3)-LEN(SUBSTITUTE(F3,\",\",\"\"))","v":1},{"$f":"IF(F3<>\"\",LEFT(F3,1),\"Z\")","v":"C"},"C101","0.1uF, 50v, 10%, Cer","0603","-55, +125",1.7999999999999999E-2,250,{"$f":"D3*J3","v":1.7999999999999999E-2},"Digi-Key",{"$f":"VLOOKUP($H3,$A$73:$G$101,2,FALSE)","v":1.6},{"$f":"VLOOKUP($H3,$A$73:$G$101,3, FALSE)","v":0.8},{"$f":"VLOOKUP($H3,$A$73:$G$101,4,FALSE)","v":0.8},{"$f":"VLOOKUP($H3,$A$73:$G$101,5,TRUE)","v":0},"mm",{"$f":"IF(AND($R3<>\"\",N3<>\"\"),N3*VLOOKUP($R3,$A$67:$B$69,2),\"\")","v":6.2992125984251968E-2},{"$f":"IF(AND($R3<>\"\",O3<>\"\"),O3*VLOOKUP($R3,$A$67:$B$69,2),\"\")","v":3.1496062992125984E-2},{"$f":"IF(AND($R3<>\"\",P3<>\"\"),P3*VLOOKUP($R3,$A$67:$B$69,2),\"\")","v":3.1496062992125984E-2},{"$f":"IF(AND($R3<>\"\",Q3<>\"\"),Q3*VLOOKUP($R3,$A$67:$B$69,2),\"\")","v":0},{"$f":"IF(R3<>\"\",IF(R3=$A$69,$A$68,$A$69),\"\")","v":"inch"}]
["Sense","TDK Corp","C1005X7S2A103K",{"$f":"1+LEN(F4)-LEN(SUBSTITUTE(F4,\",\",\"\"))","v":2},{"$f":"IF(F4<>\"\",LEFT(F4,1),\"Z\")","v":"C"},"C202,C203","0.01uF, 100v, 10%, Cer","0402T","-55, +125",2.9239999999999999E-2,250,{"$f":"D4*J4","v":5.8479999999999997E-2},"Digi-Key",{"$f":"VLOOKUP($H4,$A$73:$G$101,2,FALSE)","v":1},{"$f":"VLOOKUP($H4,$A$73:$G$101,3, FALSE)","v":0.5},{"$f":"VLOOKUP($H4,$A$73:$G$101,4,FALSE)","v":0.55000000000000004},{"$f":"VLOOKUP($H4,$A$73:$G$101,5,TRUE)","v":0},"mm",{"$f":"IF(AND($R4<>\"\",N4<>\"\"),N4*VLOOKUP($R4,$A$67:$B$69,2),\"\")","v":3.937007874015748E-2},{"$f":"IF(AND($R4<>\"\",O4<>\"\"),O4*VLOOKUP($R4,$A$67:$B$69,2),\"\")","v":1.968503937007874E-2},{"$f":"IF(AND($R4<>\"\",P4<>\"\"),P4*VLOOKUP($R4,$A$67:$B$69,2),\"\")","v":2.1653543307086617E-2},{"$f":"IF(AND($R4<>\"\",Q4<>\"\"),Q4*VLOOKUP($R4,$A$67:$B$69,2),\"\")","v":0},{"$f":"IF(R4<>\"\",IF(R4=$A$69,$A$68,$A$69),\"\")","v":"inch"}]
["+12v Clean Supply","Cornell Dubilier","AFK475M80D16T-F",{"$f":"1+LEN(F5)-LEN(SUBSTITUTE(F5,\",\",\"\"))","v":1},{"$f":"IF(F5<>\"\",LEFT(F5,1),\"Z\")","v":"C"},"C204","4.7uF, 80v, 20%, Al","CAN SMD-6","-55, +105",0.32500000000000001,100,{"$f":"D5*J5","v":0.32500000000000001},"Digi-Key",{"$f":"VLOOKUP($H5,$A$73:$G$101,2,FALSE)","v":6.3},{"$f":"VLOOKUP($H5,$A$73:$G$101,3, FALSE)","v":6.3},{"$f":"VLOOKUP($H5,$A$73:$G$101,4,FALSE)","v":5.8},{"$f":"VLOOKUP($H5,$A$73:$G$101,5,TRUE)","v":0},"mm",{"$f":"IF(AND($R5<>\"\",N5<>\"\"),N5*VLOOKUP($R5,$A$67:$B$69,2),\"\")","v":0.2480314960629921},{"$f":"IF(AND($R5<>\"\",O5<>\"\"),O5*VLOOKUP($R5,$A$67:$B$69,2),\"\")","v":0.2480314960629921},{"$f":"IF(AND($R5<>\"\",P5<>\"\"),P5*VLOOKUP($R5,$A$67:$B$69,2),\"\")","v":0.22834645669291337},{"$f":"IF(AND($R5<>\"\",Q5<>\"\"),Q5*VLOOKUP($R5,$A$67:$B$69,2),\"\")","v":0},{"$f":"IF(R5<>\"\",IF(R5=$A$69,$A$68,$A$69),\"\")","v":"inch"}]
["+3.3v Supply","TDK Corp","C2012X5R1E475K",{"$f":"1+LEN(F6)-LEN(SUBSTITUTE(F6,\",\",\"\"))","v":1},{"$f":"IF(F6<>\"\",LEFT(F6,1),\"Z\")","v":"C"},"C205","4.7uF, 25v, 10%, Cer","0805","-55, +85",0.09,250,{"$f":"D6*J6","v":0.09},"Digi-Key",{"$f":"VLOOKUP($H6,$A$73:$G$101,2,FALSE)","v":2},{"$f":"VLOOKUP($H6,$A$73:$G$101,3, FALSE)","v":1.25},{"$f":"VLOOKUP($H6,$A$73:$G$101,4,FALSE)","v":1.45},{"$f":"VLOOKUP($H6,$A$73:$G$101,5,TRUE)","v":0},"mm",{"$f":"IF(AND($R6<>\"\",N6<>\"\"),N6*VLOOKUP($R6,$A$67:$B$69,2),\"\")","v":7.874015748031496E-2},{"$f":"IF(AND($R6<>\"\",O6<>\"\"),O6*VLOOKUP($R6,$A$67:$B$69,2),\"\")","v":4.9212598425196846E-2},{"$f":"IF(AND($R6<>\"\",P6<>\"\"),P6*VLOOKUP($R6,$A$67:$B$69,2),\"\")","v":5.7086614173228342E-2},{"$f":"IF(AND($R6<>\"\",Q6<>\"\"),Q6*VLOOKUP($R6,$A$67:$B$69,2),\"\")","v":0},{"$f":"IF(R6<>\"\",IF(R6=$A$69,$A$68,$A$69),\"\")","v":"inch"}]
["+3.3v Supply","TDK Corp","C1005X5R1H471K",{"$f":"1+LEN(F7)-LEN(SUBSTITUTE(F7,\",\",\"\"))","v":1},{"$f":"IF(F7<>\"\",LEFT(F7,1),\"Z\")","v":"C"},"C206","470pF, 50v","0402","-55, +85",8.9999999999999993E-3,250,{"$f":"D7*J7","v":8.9999999999999993E-3},"Digi-Key",{"$f":"VLOOKUP($H7,$A$73:$G$101,2,FALSE)","v":1},{"$f":"VLOOKUP($H7,$A$73:$G$101,3, FALSE)","v":0.5},{"$f":"VLOOKUP($H7,$A$73:$G$101,4,FALSE)","v":0.4},{"$f":"VLOOKUP($H7,$A$73:$G$101,5,TRUE)","v":0},"mm",{"$f":"IF(AND($R7<>\"\",N7<>\"\"),N7*VLOOKUP($R7,$A$67:$B$69,2),\"\")","v":3.937007874015748E-2},{"$f":"IF(AND($R7<>\"\",O7<>\"\"),O7*VLOOKUP($R7,$A$67:$B$69,2),\"\")","v":1.968503937007874E-2},{"$f":"IF(AND($R7<>\"\",P7<>\"\"),P7*VLOOKUP($R7,$A$67:$B$69,2),\"\")","v":1.5748031496062992E-2},{"$f":"IF(AND($R7<>\"\",Q7<>\"\"),Q7*VLOOKUP($R7,$A$67:$B$69,2),\"\")","v":0},{"$f":"IF(R7<>\"\",IF(R7=$A$69,$A$68,$A$69),\"\")","v":"inch"}]
["+3.3v Supply","TDK Corp","C2012X5R1E475K",{"$f":"1+LEN(F8)-LEN(SUBSTITUTE(F8,\",\",\"\"))","v":1},{"$f":"IF(F8<>\"\",LEFT(F8,1),\"Z\")","v":"C"},"C207","4.7uF, 25v, 10%, Cer","0805","-55, +85",0.09,250,{"$f":"D8*J8","v":0.09},"Digi-Key",{"$f":"VLOOKUP($H8,$A$73:$G$101,2,FALSE)","v":2},{"$f":"VLOOKUP($H8,$A$73:$G$101,3, FALSE)","v":1.25},{"$f":"VLOOKUP($H8,$A$73:$G$101,4,FALSE)","v":1.45},{"$f":"VLOOKUP($H8,$A$73:$G$101,5,TRUE)","v":0},"mm",{"$f":"IF(AND($R8<>\"\",N8<>\"\"),N8*VLOOKUP($R8,$A$67:$B$69,2),\"\")","v":7.874015748031496E-2},{"$f":"IF(AND($R8<>\"\",O8<>\"\"),O8*VLOOKUP($R8,$A$67:$B$69,2),\"\")","v":4.9212598425196846E-2},{"$f":"IF(AND($R8<>\"\",P8<>\"\"),P8*VLOOKUP($R8,$A$67:$B$69,2),\"\")","v":5.7086614173228342E-2},{"$f":"IF(AND($R8<>\"\",Q8<>\"\"),Q8*VLOOKUP($R8,$A$67:$B$69,2),\"\")","v":0},{"$f":"IF(R8<>\"\",IF(R8=$A$69,$A$68,$A$69),\"\")","v":"inch"}]
["+12v Clean Supply","TDK Corp","C1005X7S2A103K",{"$f":"1+LEN(F9)-LEN(SUBSTITUTE(F9,\",\",\"\"))","v":1},{"$f":"IF(F9<>\"\",LEFT(F9,1),\"Z\")","v":"C"},"C208","0.01uF, 100v, 10%, Cer","0402T","-55, +125",2.9239999999999999E-2,250,{"$f":"D9*J9","v":2.9239999999999999E-2},"Digi-Key",{"$f":"VLOOKUP($H9,$A$73:$G$101,2,FALSE)","v":1},{"$f":"VLOOKUP($H9,$A$73:$G$101,3, FALSE)","v":0.5},{"$f":"VLOOKUP($H9,$A$73:$G$101,4,FALSE)","v":0.55000000000000004},{"$f":"VLOOKUP($H9,$A$73:$G$101,5,TRUE)","v":0},"mm",{"$f":"IF(AND($R9<>\"\",N9<>\"\"),N9*VLOOKUP($R9,$A$67:$B$69,2),\"\")","v":3.937007874015748E-2},{"$f":"IF(AND($R9<>\"\",O9<>\"\"),O9*VLOOKUP($R9,$A$67:$B$69,2),\"\")","v":1.968503937007874E-2},{"$f":"IF(AND($R9<>\"\",P9<>\"\"),P9*VLOOKUP($R9,$A$67:$B$69,2),\"\")","v":2.1653543307086617E-2},{"$f":"IF(AND($R9<>\"\",Q9<>\"\"),Q9*VLOOKUP($R9,$A$67:$B$69,2),\"\")","v":0},{"$f":"IF(R9<>\"\",IF(R9=$A$69,$A$68,$A$69),\"\")","v":"inch"}]
["+12v Supply","TDK Corp","C1608X7R1E684K",{"$f":"1+LEN(F10)-LEN(SUBSTITUTE(F10,\",\",\"\"))","v":1},{"$f":"IF(F10<>\"\",LEFT(F10,1),\"Z\")","v":"C"},"C209","0.68uF, 25v, 10%, Cer","0603","-55, +125",7.4999999999999997E-2,250,{"$f":"D10*J10","v":7.4999999999999997E-2},"Digi-Key",{"$f":"VLOOKUP($H10,$A$73:$G$101,2,FALSE)","v":1.6},{"$f":"VLOOKUP($H10,$A$73:$G$101,3, FALSE)","v":0.8},{"$f":"VLOOKUP($H10,$A$73:$G$101,4,FALSE)","v":0.8},{"$f":"VLOOKUP($H10,$A$73:$G$101,5,TRUE)","v":0},"mm",{"$f":"IF(AND($R10<>\"\",N10<>\"\"),N10*VLOOKUP($R10,$A$67:$B$69,2),\"\")","v":6.2992125984251968E-2},{"$f":"IF(AND($R10<>\"\",O10<>\"\"),O10*VLOOKUP($R10,$A$67:$B$69,2),\"\")","v":3.1496062992125984E-2},{"$f":"IF(AND($R10<>\"\",P10<>\"\"),P10*VLOOKUP($R10,$A$67:$B$69,2),\"\")","v":3.1496062992125984E-2},{"$f":"IF(AND($R10<>\"\",Q10<>\"\"),Q10*VLOOKUP($R10,$A$67:$B$69,2),\"\")","v":0},{"$f":"IF(R10<>\"\",IF(R10=$A$69,$A$68,$A$69),\"\")","v":"inch"}]
["+12v Supply","TDK Corp","C5750X7S2A106M",{"$f":"1+LEN(F11)-LEN(SUBSTITUTE(F11,\",\",\"\"))","v":1},{"$f":"IF(F11<>\"\",LEFT(F11,1),\"Z\")","v":"C"},"C210","10uF, 100v, 20%, Cer","2220","-55, +125",1.41,100,{"$f":"D11*J11","v":1.41},"Digi-Key",{"$f":"VLOOKUP($H11,$A$73:$G$101,2,FALSE)","v":5.7},{"$f":"VLOOKUP($H11,$A$73:$G$101,3, FALSE)","v":5},{"$f":"VLOOKUP($H11,$A$73:$G$101,4,FALSE)","v":2.5},{"$f":"VLOOKUP($H11,$A$73:$G$101,5,TRUE)","v":0},"mm",{"$f":"IF(AND($R11<>\"\",N11<>\"\"),N11*VLOOKUP($R11,$A$67:$B$69,2),\"\")","v":0.22440944881889766},{"$f":"IF(AND($R11<>\"\",O11<>\"\"),O11*VLOOKUP($R11,$A$67:$B$69,2),\"\")","v":0.19685039370078738},{"$f":"IF(AND($R11<>\"\",P11<>\"\"),P11*VLOOKUP($R11,$A$67:$B$69,2),\"\")","v":9.8425196850393692E-2},{"$f":"IF(AND($R11<>\"\",Q11<>\"\"),Q11*VLOOKUP($R11,$A$67:$B$69,2),\"\")","v":0},{"$f":"IF(R11<>\"\",IF(R11=$A$69,$A$68,$A$69),\"\")","v":"inch"}]
["+12v Supply","Taiyo Yuden","UMK105B7102KV-F",{"$f":"1+LEN(F12)-LEN(SUBSTITUTE(F12,\",\",\"\"))","v":3},{"$f":"IF(F12<>\"\",LEFT(F12,1),\"Z\")","v":"C"},"C211,C215,C217","1000pF, 50v, 10% (OMIT)","0402","-55, +125",7.7999999999999996E-3,250,{"$f":"D12*J12","v":2.3399999999999997E-2},"Digi-Key",{"$f":"VLOOKUP($H12,$A$73:$G$101,2,FALSE)","v":1},{"$f":"VLOOKUP($H12,$A$73:$G$101,3, FALSE)","v":0.5},{"$f":"VLOOKUP($H12,$A$73:$G$101,4,FALSE)","v":0.4},{"$f":"VLOOKUP($H12,$A$73:$G$101,5,TRUE)","v":0},"mm",{"$f":"IF(AND($R12<>\"\",N12<>\"\"),N12*VLOOKUP($R12,$A$67:$B$69,2),\"\")","v":3.937007874015748E-2},{"$f":"IF(AND($R12<>\"\",O12<>\"\"),O12*VLOOKUP($R12,$A$67:$B$69,2),\"\")","v":1.968503937007874E-2},{"$f":"IF(AND($R12<>\"\",P12<>\"\"),P12*VLOOKUP($R12,$A$67:$B$69,2),\"\")","v":1.5748031496062992E-2},{"$f":"IF(AND($R12<>\"\",Q12<>\"\"),Q12*VLOOKUP($R12,$A$67:$B$69,2),\"\")","v":0},{"$f":"IF(R12<>\"\",IF(R12=$A$69,$A$68,$A$69),\"\")","v":"inch"}]
["+12v Supply","Taiyo Yuden","UMK105B7102KV-F",{"$f":"1+LEN(F13)-LEN(SUBSTITUTE(F13,\",\",\"\"))","v":1},{"$f":"IF(F13<>\"\",LEFT(F13,1),\"Z\")","v":"C"},"C212","1000pF, 50v, 10%","0402","-55, +125",7.7999999999999996E-3,250,{"$f":"D13*J13","v":7.7999999999999996E-3},"Digi-Key",{"$f":"VLOOKUP($H13,$A$73:$G$101,2,FALSE)","v":1},{"$f":"VLOOKUP($H13,$A$73:$G$101,3, FALSE)","v":0.5},{"$f":"VLOOKUP($H13,$A$73:$G$101,4,FALSE)","v":0.4},{"$f":"VLOOKUP($H13,$A$73:$G$101,5,TRUE)","v":0},"mm",{"$f":"IF(AND($R13<>\"\",N13<>\"\"),N13*VLOOKUP($R13,$A$67:$B$69,2),\"\")","v":3.937007874015748E-2},{"$f":"IF(AND($R13<>\"\",O13<>\"\"),O13*VLOOKUP($R13,$A$67:$B$69,2),\"\")","v":1.968503937007874E-2},{"$f":"IF(AND($R13<>\"\",P13<>\"\"),P13*VLOOKUP($R13,$A$67:$B$69,2),\"\")","v":1.5748031496062992E-2},{"$f":"IF(AND($R13<>\"\",Q13<>\"\"),Q13*VLOOKUP($R13,$A$67:$B$69,2),\"\")","v":0},{"$f":"IF(R13<>\"\",IF(R13=$A$69,$A$68,$A$69),\"\")","v":"inch"}]
["+12v Supply","TDK Corp","C1005X7S1A474K",{"$f":"1+LEN(F14)-LEN(SUBSTITUTE(F14,\",\",\"\"))","v":1},{"$f":"IF(F14<>\"\",LEFT(F14,1),\"Z\")","v":"C"},"C213","0.47uF, 10v, 10%, Cer","0402","-55, +125",3.5999999999999997E-2,250,{"$f":"D14*J14","v":3.5999999999999997E-2},"Digi-Key",{"$f":"VLOOKUP($H14,$A$73:$G$101,2,FALSE)","v":1},{"$f":"VLOOKUP($H14,$A$73:$G$101,3, FALSE)","v":0.5},{"$f":"VLOOKUP($H14,$A$73:$G$101,4,FALSE)","v":0.4},{"$f":"VLOOKUP($H14,$A$73:$G$101,5,TRUE)","v":0},"mm",{"$f":"IF(AND($R14<>\"\",N14<>\"\"),N14*VLOOKUP($R14,$A$67:$B$69,2),\"\")","v":3.937007874015748E-2},{"$f":"IF(AND($R14<>\"\",O14<>\"\"),O14*VLOOKUP($R14,$A$67:$B$69,2),\"\")","v":1.968503937007874E-2},{"$f":"IF(AND($R14<>\"\",P14<>\"\"),P14*VLOOKUP($R14,$A$67:$B$69,2),\"\")","v":1.5748031496062992E-2},{"$f":"IF(AND($R14<>\"\",Q14<>\"\"),Q14*VLOOKUP($R14,$A$67:$B$69,2),\"\")","v":0},{"$f":"IF(R14<>\"\",IF(R14=$A$69,$A$68,$A$69),\"\")","v":"inch"}]
["+12v Supply","Johanson Dielectrics","160S41X226KV4E",{"$f":"1+LEN(F15)-LEN(SUBSTITUTE(F15,\",\",\"\"))","v":2},{"$f":"IF(F15<>\"\",LEFT(F15,1),\"Z\")","v":"C"},"C214,C218","22uF, 16v, 10%, X5R Cer","1210","-55, +85",0.71679999999999999,250,{"$f":"D15*J15","v":1.4336},"Digi-Key",{"$f":"VLOOKUP($H15,$A$73:$G$101,2,FALSE)","v":3.2},{"$f":"VLOOKUP($H15,$A$73:$G$101,3, FALSE)","v":2.44},{"$f":"VLOOKUP($H15,$A$73:$G$101,4,FALSE)","v":2.8},{"$f":"VLOOKUP($H15,$A$73:$G$101,5,TRUE)","v":0},"mm",{"$f":"IF(AND($R15<>\"\",N15<>\"\"),N15*VLOOKUP($R15,$A$67:$B$69,2),\"\")","v":0.12598425196850394},{"$f":"IF(AND($R15<>\"\",O15<>\"\"),O15*VLOOKUP($R15,$A$67:$B$69,2),\"\")","v":9.6062992125984251E-2},{"$f":"IF(AND($R15<>\"\",P15<>\"\"),P15*VLOOKUP($R15,$A$67:$B$69,2),\"\")","v":0.11023622047244093},{"$f":"IF(AND($R15<>\"\",Q15<>\"\"),Q15*VLOOKUP($R15,$A$67:$B$69,2),\"\")","v":0},{"$f":"IF(R15<>\"\",IF(R15=$A$69,$A$68,$A$69),\"\")","v":"inch"}]
["+12v Supply","Panasonic","EEE-2AA100UP",{"$f":"1+LEN(F16)-LEN(SUBSTITUTE(F16,\",\",\"\"))","v":1},{"$f":"IF(F16<>\"\",LEFT(F16,1),\"Z\")","v":"C"},"C216","10uF, 100v, 20%, Alu","CAN SMD-8","-40, +85",0.29108000000000001,250,{"$f":"D16*J16","v":0.29108000000000001},"Digi-Key",{"$f":"VLOOKUP($H16,$A$73:$G$101,2,FALSE)","v":8},{"$f":"VLOOKUP($H16,$A$73:$G$101,3, FALSE)","v":8},{"$f":"VLOOKUP($H16,$A$73:$G$101,4,FALSE)","v":6.2},{"$f":"VLOOKUP($H16,$A$73:$G$101,5,TRUE)","v":0},"mm",{"$f":"IF(AND($R16<>\"\",N16<>\"\"),N16*VLOOKUP($R16,$A$67:$B$69,2),\"\")","v":0.31496062992125984},{"$f":"IF(AND($R16<>\"\",O16<>\"\"),O16*VLOOKUP($R16,$A$67:$B$69,2),\"\")","v":0.31496062992125984},{"$f":"IF(AND($R16<>\"\",P16<>\"\"),P16*VLOOKUP($R16,$A$67:$B$69,2),\"\")","v":0.24409448818897639},{"$f":"IF(AND($R16<>\"\",Q16<>\"\"),Q16*VLOOKUP($R16,$A$67:$B$69,2),\"\")","v":0},{"$f":"IF(R16<>\"\",IF(R16=$A$69,$A$68,$A$69),\"\")","v":"inch"}]
["Motor","TDK Corp","C1608X7R1H104K",{"$f":"1+LEN(F17)-LEN(SUBSTITUTE(F17,\",\",\"\"))","v":1},{"$f":"IF(F17<>\"\",LEFT(F17,1),\"Z\")","v":"C"},"C301","0.1uF, 50v, 10%, Cer","0603","-55, +125",1.7999999999999999E-2,250,{"$f":"D17*J17","v":1.7999999999999999E-2},"Digi-Key",{"$f":"VLOOKUP($H17,$A$73:$G$101,2,FALSE)","v":1.6},{"$f":"VLOOKUP($H17,$A$73:$G$101,3, FALSE)","v":0.8},{"$f":"VLOOKUP($H17,$A$73:$G$101,4,FALSE)","v":0.8},{"$f":"VLOOKUP($H17,$A$73:$G$101,5,TRUE)","v":0},"mm",{"$f":"IF(AND($R17<>\"\",N17<>\"\"),N17*VLOOKUP($R17,$A$67:$B$69,2),\"\")","v":6.2992125984251968E-2},{"$f":"IF(AND($R17<>\"\",O17<>\"\"),O17*VLOOKUP($R17,$A$67:$B$69,2),\"\")","v":3.1496062992125984E-2},{"$f":"IF(AND($R17<>\"\",P17<>\"\"),P17*VLOOKUP($R17,$A$67:$B$69,2),\"\")","v":3.1496062992125984E-2},{"$f":"IF(AND($R17<>\"\",Q17<>\"\"),Q17*VLOOKUP($R17,$A$67:$B$69,2),\"\")","v":0},{"$f":"IF(R17<>\"\",IF(R17=$A$69,$A$68,$A$69),\"\")","v":"inch"}]
["Wake Out","TDK Corp","C1608X7R1H104K",{"$f":"1+LEN(F18)-LEN(SUBSTITUTE(F18,\",\",\"\"))","v":1},{"$f":"IF(F18<>\"\",LEFT(F18,1),\"Z\")","v":"C"},"C302","0.1uF, 50v, 10%, Cer","0603","-55, +125",1.7999999999999999E-2,250,{"$f":"D18*J18","v":1.7999999999999999E-2},"Digi-Key",{"$f":"VLOOKUP($H18,$A$73:$G$101,2,FALSE)","v":1.6},{"$f":"VLOOKUP($H18,$A$73:$G$101,3, FALSE)","v":0.8},{"$f":"VLOOKUP($H18,$A$73:$G$101,4,FALSE)","v":0.8},{"$f":"VLOOKUP($H18,$A$73:$G$101,5,TRUE)","v":0},"mm",{"$f":"IF(AND($R18<>\"\",N18<>\"\"),N18*VLOOKUP($R18,$A$67:$B$69,2),\"\")","v":6.2992125984251968E-2},{"$f":"IF(AND($R18<>\"\",O18<>\"\"),O18*VLOOKUP($R18,$A$67:$B$69,2),\"\")","v":3.1496062992125984E-2},{"$f":"IF(AND($R18<>\"\",P18<>\"\"),P18*VLOOKUP($R18,$A$67:$B$69,2),\"\")","v":3.1496062992125984E-2},{"$f":"IF(AND($R18<>\"\",Q18<>\"\"),Q18*VLOOKUP($R18,$A$67:$B$69,2),\"\")","v":0},{"$f":"IF(R18<>\"\",IF(R18=$A$69,$A$68,$A$69),\"\")","v":"inch"}]
["LIN","TDK Corp","C1608C0G2A221J",{"$f":"1+LEN(F19)-LEN(SUBSTITUTE(F19,\",\",\"\"))","v":1},{"$f":"IF(F19<>\"\",LEFT(F19,1),\"Z\")","v":"C"},"C303","220pF, 100v, 5%, Cer","0603","-55, +125",3.9E-2,250,{"$f":"D19*J19","v":3.9E-2},"Digi-Key",{"$f":"VLOOKUP($H19,$A$73:$G$101,2,FALSE)","v":1.6},{"$f":"VLOOKUP($H19,$A$73:$G$101,3, FALSE)","v":0.8},{"$f":"VLOOKUP($H19,$A$73:$G$101,4,FALSE)","v":0.8},{"$f":"VLOOKUP($H19,$A$73:$G$101,5,TRUE)","v":0},"mm",{"$f":"IF(AND($R19<>\"\",N19<>\"\"),N19*VLOOKUP($R19,$A$67:$B$69,2),\"\")","v":6.2992125984251968E-2},{"$f":"IF(AND($R19<>\"\",O19<>\"\"),O19*VLOOKUP($R19,$A$67:$B$69,2),\"\")","v":3.1496062992125984E-2},{"$f":"IF(AND($R19<>\"\",P19<>\"\"),P19*VLOOKUP($R19,$A$67:$B$69,2),\"\")","v":3.1496062992125984E-2},{"$f":"IF(AND($R19<>\"\",Q19<>\"\"),Q19*VLOOKUP($R19,$A$67:$B$69,2),\"\")","v":0},{"$f":"IF(R19<>\"\",IF(R19=$A$69,$A$68,$A$69),\"\")","v":"inch"}]
["LIN","TDK Corp","C1608X7R1H104K",{"$f":"1+LEN(F20)-LEN(SUBSTITUTE(F20,\",\",\"\"))","v":1},{"$f":"IF(F20<>\"\",LEFT(F20,1),\"Z\")","v":"C"},"C304","0.1uF, 50v, 10%, Cer","0603","-55, +125",1.7999999999999999E-2,250,{"$f":"D20*J20","v":1.7999999999999999E-2},"Digi-Key",{"$f":"VLOOKUP($H20,$A$73:$G$101,2,FALSE)","v":1.6},{"$f":"VLOOKUP($H20,$A$73:$G$101,3, FALSE)","v":0.8},{"$f":"VLOOKUP($H20,$A$73:$G$101,4,FALSE)","v":0.8},{"$f":"VLOOKUP($H20,$A$73:$G$101,5,TRUE)","v":0},"mm",{"$f":"IF(AND($R20<>\"\",N20<>\"\"),N20*VLOOKUP($R20,$A$67:$B$69,2),\"\")","v":6.2992125984251968E-2},{"$f":"IF(AND($R20<>\"\",O20<>\"\"),O20*VLOOKUP($R20,$A$67:$B$69,2),\"\")","v":3.1496062992125984E-2},{"$f":"IF(AND($R20<>\"\",P20<>\"\"),P20*VLOOKUP($R20,$A$67:$B$69,2),\"\")","v":3.1496062992125984E-2},{"$f":"IF(AND($R20<>\"\",Q20<>\"\"),Q20*VLOOKUP($R20,$A$67:$B$69,2),\"\")","v":0},{"$f":"IF(R20<>\"\",IF(R20=$A$69,$A$68,$A$69),\"\")","v":"inch"}]
["+12v Clean Supply","NXP","BAS16,215",{"$f":"1+LEN(F21)-LEN(SUBSTITUTE(F21,\",\",\"\"))","v":1},{"$f":"IF(F21<>\"\",LEFT(F21,1),\"Z\")","v":"D"},"D201","215mA, 100v, 250mW","SOT-23","-65, +150",4.752E-2,250,{"$f":"D21*J21","v":4.752E-2},"Digi-Key",{"$f":"VLOOKUP($H21,$A$73:$G$101,2,FALSE)","v":3.04},{"$f":"VLOOKUP($H21,$A$73:$G$101,3, FALSE)","v":2.64},{"$f":"VLOOKUP($H21,$A$73:$G$101,4,FALSE)","v":1.22},{"$f":"VLOOKUP($H21,$A$73:$G$101,5,TRUE)","v":0},"mm",{"$f":"IF(AND($R21<>\"\",N21<>\"\"),N21*VLOOKUP($R21,$A$67:$B$69,2),\"\")","v":0.11968503937007874},{"$f":"IF(AND($R21<>\"\",O21<>\"\"),O21*VLOOKUP($R21,$A$67:$B$69,2),\"\")","v":0.10393700787401575},{"$f":"IF(AND($R21<>\"\",P21<>\"\"),P21*VLOOKUP($R21,$A$67:$B$69,2),\"\")","v":4.8031496062992125E-2},{"$f":"IF(AND($R21<>\"\",Q21<>\"\"),Q21*VLOOKUP($R21,$A$67:$B$69,2),\"\")","v":0},{"$f":"IF(R21<>\"\",IF(R21=$A$69,$A$68,$A$69),\"\")","v":"inch"}]
["+12v Supply","On Semi","MBRS360BT3G",{"$f":"1+LEN(F22)-LEN(SUBSTITUTE(F22,\",\",\"\"))","v":1},{"$f":"IF(F22<>\"\",LEFT(F22,1),\"Z\")","v":"D"},"D202","4A, 60v","SMB",null,0.26047999999999999,250,{"$f":"D22*J22","v":0.26047999999999999},"Digi-Key",{"$f":"VLOOKUP($H22,$A$73:$G$101,2,FALSE)","v":7.1},{"$f":"VLOOKUP($H22,$A$73:$G$101,3, FALSE)","v":6.1},{"$f":"VLOOKUP($H22,$A$73:$G$101,4,FALSE)","v":2.41},{"$f":"VLOOKUP($H22,$A$73:$G$101,5,TRUE)","v":0},"mm",{"$f":"IF(AND($R22<>\"\",N22<>\"\"),N22*VLOOKUP($R22,$A$67:$B$69,2),\"\")","v":0.27952755905511811},{"$f":"IF(AND($R22<>\"\",O22<>\"\"),O22*VLOOKUP($R22,$A$67:$B$69,2),\"\")","v":0.24015748031496062},{"$f":"IF(AND($R22<>\"\",P22<>\"\"),P22*VLOOKUP($R22,$A$67:$B$69,2),\"\")","v":9.4881889763779537E-2},{"$f":"IF(AND($R22<>\"\",Q22<>\"\"),Q22*VLOOKUP($R22,$A$67:$B$69,2),\"\")","v":0},{"$f":"IF(R22<>\"\",IF(R22=$A$69,$A$68,$A$69),\"\")","v":"inch"}]
["Micro","Microchip","PIC18F25K22-E/SO",{"$f":"1+LEN(F23)-LEN(SUBSTITUTE(F23,\",\",\"\"))","v":1},{"$f":"IF(F23<>\"\",LEFT(F23,1),\"Z\")","v":"I"},"IC101","PIC Microprocessor","SOIC-28","-65, +150",2.08,300,{"$f":"D23*J23","v":2.08},"Digi-Key",{"$f":"VLOOKUP($H23,$A$73:$G$101,2,FALSE)","v":17.899999999999999},{"$f":"VLOOKUP($H23,$A$73:$G$101,3, FALSE)","v":10.3},{"$f":"VLOOKUP($H23,$A$73:$G$101,4,FALSE)","v":2.65},{"$f":"VLOOKUP($H23,$A$73:$G$101,5,TRUE)","v":0},"mm",{"$f":"IF(AND($R23<>\"\",N23<>\"\"),N23*VLOOKUP($R23,$A$67:$B$69,2),\"\")","v":0.70472440944881887},{"$f":"IF(AND($R23<>\"\",O23<>\"\"),O23*VLOOKUP($R23,$A$67:$B$69,2),\"\")","v":0.40551181102362205},{"$f":"IF(AND($R23<>\"\",P23<>\"\"),P23*VLOOKUP($R23,$A$67:$B$69,2),\"\")","v":0.10433070866141732},{"$f":"IF(AND($R23<>\"\",Q23<>\"\"),Q23*VLOOKUP($R23,$A$67:$B$69,2),\"\")","v":0},{"$f":"IF(R23<>\"\",IF(R23=$A$69,$A$68,$A$69),\"\")","v":"inch"}]
["+12v Clean Supply","TI","TPS7A1601DGNR ",{"$f":"1+LEN(F24)-LEN(SUBSTITUTE(F24,\",\",\"\"))","v":1},{"$f":"IF(F24<>\"\",LEFT(F24,1),\"Z\")","v":"I"},"IC201","12v Low, Power Regulator","MSOP-8","-40, +125",2.6739999999999999,250,{"$f":"D24*J24","v":2.6739999999999999},"Digi-Key",{"$f":"VLOOKUP($H24,$A$73:$G$101,2,FALSE)","v":5},{"$f":"VLOOKUP($H24,$A$73:$G$101,3, FALSE)","v":3},{"$f":"VLOOKUP($H24,$A$73:$G$101,4,FALSE)","v":1.1000000000000001},{"$f":"VLOOKUP($H24,$A$73:$G$101,5,TRUE)","v":0},"mm",{"$f":"IF(AND($R24<>\"\",N24<>\"\"),N24*VLOOKUP($R24,$A$67:$B$69,2),\"\")","v":0.19685039370078738},{"$f":"IF(AND($R24<>\"\",O24<>\"\"),O24*VLOOKUP($R24,$A$67:$B$69,2),\"\")","v":0.11811023622047244},{"$f":"IF(AND($R24<>\"\",P24<>\"\"),P24*VLOOKUP($R24,$A$67:$B$69,2),\"\")","v":4.3307086614173235E-2},{"$f":"IF(AND($R24<>\"\",Q24<>\"\"),Q24*VLOOKUP($R24,$A$67:$B$69,2),\"\")","v":0},{"$f":"IF(R24<>\"\",IF(R24=$A$69,$A$68,$A$69),\"\")","v":"inch"}]
["+12v Supply","Linear Tech","LT3690EUFE#PBF",{"$f":"1+LEN(F25)-LEN(SUBSTITUTE(F25,\",\",\"\"))","v":1},{"$f":"IF(F25<>\"\",LEFT(F25,1),\"Z\")","v":"I"},"IC202","LTC3690 Switching P.S.","26-WFQFN ","-40, +125",6.01,100,{"$f":"D25*J25","v":6.01},"Digi-Key",{"$f":"VLOOKUP($H25,$A$73:$G$101,2,FALSE)","v":6},{"$f":"VLOOKUP($H25,$A$73:$G$101,3, FALSE)","v":4},{"$f":"VLOOKUP($H25,$A$73:$G$101,4,FALSE)","v":0.74},{"$f":"VLOOKUP($H25,$A$73:$G$101,5,TRUE)","v":0},"mm",{"$f":"IF(AND($R25<>\"\",N25<>\"\"),N25*VLOOKUP($R25,$A$67:$B$69,2),\"\")","v":0.23622047244094488},{"$f":"IF(AND($R25<>\"\",O25<>\"\"),O25*VLOOKUP($R25,$A$67:$B$69,2),\"\")","v":0.15748031496062992},{"$f":"IF(AND($R25<>\"\",P25<>\"\"),P25*VLOOKUP($R25,$A$67:$B$69,2),\"\")","v":2.9133858267716535E-2},{"$f":"IF(AND($R25<>\"\",Q25<>\"\"),Q25*VLOOKUP($R25,$A$67:$B$69,2),\"\")","v":0},{"$f":"IF(R25<>\"\",IF(R25=$A$69,$A$68,$A$69),\"\")","v":"inch"}]
["+3.3v Supply","Micrel","MIC5205-3.3YM5 TR",{"$f":"1+LEN(F26)-LEN(SUBSTITUTE(F26,\",\",\"\"))","v":1},{"$f":"IF(F26<>\"\",LEFT(F26,1),\"Z\")","v":"I"},"IC203","3.3v Regulator - 16v input","SOT-23-5","-40, +125",0.57199999999999995,250,{"$f":"D26*J26","v":0.57199999999999995},"Digi-Key",{"$f":"VLOOKUP($H26,$A$73:$G$101,2,FALSE)","v":3.04},{"$f":"VLOOKUP($H26,$A$73:$G$101,3, FALSE)","v":3},{"$f":"VLOOKUP($H26,$A$73:$G$101,4,FALSE)","v":1.3},{"$f":"VLOOKUP($H26,$A$73:$G$101,5,TRUE)","v":0},"mm",{"$f":"IF(AND($R26<>\"\",N26<>\"\"),N26*VLOOKUP($R26,$A$67:$B$69,2),\"\")","v":0.11968503937007874},{"$f":"IF(AND($R26<>\"\",O26<>\"\"),O26*VLOOKUP($R26,$A$67:$B$69,2),\"\")","v":0.11811023622047244},{"$f":"IF(AND($R26<>\"\",P26<>\"\"),P26*VLOOKUP($R26,$A$67:$B$69,2),\"\")","v":5.1181102362204724E-2},{"$f":"IF(AND($R26<>\"\",Q26<>\"\"),Q26*VLOOKUP($R26,$A$67:$B$69,2),\"\")","v":0},{"$f":"IF(R26<>\"\",IF(R26=$A$69,$A$68,$A$69),\"\")","v":"inch"}]
["Motor","Infineon","TLE5205-2G",{"$f":"1+LEN(F27)-LEN(SUBSTITUTE(F27,\",\",\"\"))","v":1},{"$f":"IF(F27<>\"\",LEFT(F27,1),\"Z\")","v":"I"},"IC301","H-Bridge","TO-263","-40, +150",4.9189999999999996,100,{"$f":"D27*J27","v":4.9189999999999996},"Digi-Key",{"$f":"VLOOKUP($H27,$A$73:$G$101,2,FALSE)","v":15},{"$f":"VLOOKUP($H27,$A$73:$G$101,3, FALSE)","v":10},{"$f":"VLOOKUP($H27,$A$73:$G$101,4,FALSE)","v":4.4000000000000004},{"$f":"VLOOKUP($H27,$A$73:$G$101,5,TRUE)","v":0},"mm",{"$f":"IF(AND($R27<>\"\",N27<>\"\"),N27*VLOOKUP($R27,$A$67:$B$69,2),\"\")","v":0.59055118110236215},{"$f":"IF(AND($R27<>\"\",O27<>\"\"),O27*VLOOKUP($R27,$A$67:$B$69,2),\"\")","v":0.39370078740157477},{"$f":"IF(AND($R27<>\"\",P27<>\"\"),P27*VLOOKUP($R27,$A$67:$B$69,2),\"\")","v":0.17322834645669294},{"$f":"IF(AND($R27<>\"\",Q27<>\"\"),Q27*VLOOKUP($R27,$A$67:$B$69,2),\"\")","v":0},{"$f":"IF(R27<>\"\",IF(R27=$A$69,$A$68,$A$69),\"\")","v":"inch"}]
["Wake Out","Infineon","BSP452",{"$f":"1+LEN(F28)-LEN(SUBSTITUTE(F28,\",\",\"\"))","v":1},{"$f":"IF(F28<>\"\",LEFT(F28,1),\"Z\")","v":"I"},"IC302","High side switch","SOT-223","-40, +150",1.2824,100,{"$f":"D28*J28","v":1.2824},"Digi-Key",{"$f":"VLOOKUP($H28,$A$73:$G$101,2,FALSE)","v":6.5},{"$f":"VLOOKUP($H28,$A$73:$G$101,3, FALSE)","v":7},{"$f":"VLOOKUP($H28,$A$73:$G$101,4,FALSE)","v":1.7},{"$f":"VLOOKUP($H28,$A$73:$G$101,5,TRUE)","v":0},"mm",{"$f":"IF(AND($R28<>\"\",N28<>\"\"),N28*VLOOKUP($R28,$A$67:$B$69,2),\"\")","v":0.25590551181102361},{"$f":"IF(AND($R28<>\"\",O28<>\"\"),O28*VLOOKUP($R28,$A$67:$B$69,2),\"\")","v":0.27559055118110237},{"$f":"IF(AND($R28<>\"\",P28<>\"\"),P28*VLOOKUP($R28,$A$67:$B$69,2),\"\")","v":6.6929133858267709E-2},{"$f":"IF(AND($R28<>\"\",Q28<>\"\"),Q28*VLOOKUP($R28,$A$67:$B$69,2),\"\")","v":0},{"$f":"IF(R28<>\"\",IF(R28=$A$69,$A$68,$A$69),\"\")","v":"inch"}]
["LIN","Infineon","TLE7259-2GU",{"$f":"1+LEN(F29)-LEN(SUBSTITUTE(F29,\",\",\"\"))","v":1},{"$f":"IF(F29<>\"\",LEFT(F29,1),\"Z\")","v":"I"},"IC303","LIN Transceiver","8-SOIC","-40, +150",1.1047199999999999,100,{"$f":"D29*J29","v":1.1047199999999999},"Digi-Key",{"$f":"VLOOKUP($H29,$A$73:$G$101,2,FALSE)","v":5},{"$f":"VLOOKUP($H29,$A$73:$G$101,3, FALSE)","v":6},{"$f":"VLOOKUP($H29,$A$73:$G$101,4,FALSE)","v":1.75},{"$f":"VLOOKUP($H29,$A$73:$G$101,5,TRUE)","v":0},"mm",{"$f":"IF(AND($R29<>\"\",N29<>\"\"),N29*VLOOKUP($R29,$A$67:$B$69,2),\"\")","v":0.19685039370078738},{"$f":"IF(AND($R29<>\"\",O29<>\"\"),O29*VLOOKUP($R29,$A$67:$B$69,2),\"\")","v":0.23622047244094488},{"$f":"IF(AND($R29<>\"\",P29<>\"\"),P29*VLOOKUP($R29,$A$67:$B$69,2),\"\")","v":6.8897637795275593E-2},{"$f":"IF(AND($R29<>\"\",Q29<>\"\"),Q29*VLOOKUP($R29,$A$67:$B$69,2),\"\")","v":0},{"$f":"IF(R29<>\"\",IF(R29=$A$69,$A$68,$A$69),\"\")","v":"inch"}]
["Keypad","FCI","SFW8S-2STME1LF",{"$f":"1+LEN(F30)-LEN(SUBSTITUTE(F30,\",\",\"\"))","v":1},{"$f":"IF(F30<>\"\",LEFT(F30,1),\"Z\")","v":"J"},"J101","8-pin flex cable connector","SFW8S",null,0.59599999999999997,250,{"$f":"D30*J30","v":0.59599999999999997},"Digi-Key",{"$f":"VLOOKUP($H30,$A$73:$G$101,2,FALSE)","v":14.4},{"$f":"VLOOKUP($H30,$A$73:$G$101,3, FALSE)","v":3.6},{"$f":"VLOOKUP($H30,$A$73:$G$101,4,FALSE)","v":5.3},{"$f":"VLOOKUP($H30,$A$73:$G$101,5,TRUE)","v":0},"mm",{"$f":"IF(AND($R30<>\"\",N30<>\"\"),N30*VLOOKUP($R30,$A$67:$B$69,2),\"\")","v":0.56692913385826771},{"$f":"IF(AND($R30<>\"\",O30<>\"\"),O30*VLOOKUP($R30,$A$67:$B$69,2),\"\")","v":0.14173228346456693},{"$f":"IF(AND($R30<>\"\",P30<>\"\"),P30*VLOOKUP($R30,$A$67:$B$69,2),\"\")","v":0.20866141732283464},{"$f":"IF(AND($R30<>\"\",Q30<>\"\"),Q30*VLOOKUP($R30,$A$67:$B$69,2),\"\")","v":0},{"$f":"IF(R30<>\"\",IF(R30=$A$69,$A$68,$A$69),\"\")","v":"inch"}]
["Micro","Sullins","LPPB032NFSS-RC",{"$f":"1+LEN(F31)-LEN(SUBSTITUTE(F31,\",\",\"\"))","v":1},{"$f":"IF(F31<>\"\",LEFT(F31,1),\"Z\")","v":"J"},"J102","6-Pin Programming connector","Sullins-6PS",null,0.65451999999999999,250,{"$f":"D31*J31","v":0.65451999999999999},"Digi-Key",{"$f":"VLOOKUP($H31,$A$73:$G$101,2,FALSE)","v":4.21},{"$f":"VLOOKUP($H31,$A$73:$G$101,3, FALSE)","v":3.1},{"$f":"VLOOKUP($H31,$A$73:$G$101,4,FALSE)","v":4.5},{"$f":"VLOOKUP($H31,$A$73:$G$101,5,TRUE)","v":0},"mm",{"$f":"IF(AND($R31<>\"\",N31<>\"\"),N31*VLOOKUP($R31,$A$67:$B$69,2),\"\")","v":0.16574803149606299},{"$f":"IF(AND($R31<>\"\",O31<>\"\"),O31*VLOOKUP($R31,$A$67:$B$69,2),\"\")","v":0.12204724409448819},{"$f":"IF(AND($R31<>\"\",P31<>\"\"),P31*VLOOKUP($R31,$A$67:$B$69,2),\"\")","v":0.17716535433070865},{"$f":"IF(AND($R31<>\"\",Q31<>\"\"),Q31*VLOOKUP($R31,$A$67:$B$69,2),\"\")","v":0},{"$f":"IF(R31<>\"\",IF(R31=$A$69,$A$68,$A$69),\"\")","v":"inch"}]
["Development","Panasonic","LNJ308G8LRA",{"$f":"1+LEN(F32)-LEN(SUBSTITUTE(F32,\",\",\"\"))","v":2},{"$f":"IF(F32<>\"\",LEFT(F32,1),\"Z\")","v":"L"},"LED101,LED102","Green LEDs (-30 to +85) (DEVELOPMENT)","0603","-30, +85",0.13900000000000001,250,{"$f":"D32*J32","v":0.27800000000000002},"Digi-Key",{"$f":"VLOOKUP($H32,$A$73:$G$101,2,FALSE)","v":1.6},{"$f":"VLOOKUP($H32,$A$73:$G$101,3, FALSE)","v":0.8},{"$f":"VLOOKUP($H32,$A$73:$G$101,4,FALSE)","v":0.8},{"$f":"VLOOKUP($H32,$A$73:$G$101,5,TRUE)","v":0},"mm",{"$f":"IF(AND($R32<>\"\",N32<>\"\"),N32*VLOOKUP($R32,$A$67:$B$69,2),\"\")","v":6.2992125984251968E-2},{"$f":"IF(AND($R32<>\"\",O32<>\"\"),O32*VLOOKUP($R32,$A$67:$B$69,2),\"\")","v":3.1496062992125984E-2},{"$f":"IF(AND($R32<>\"\",P32<>\"\"),P32*VLOOKUP($R32,$A$67:$B$69,2),\"\")","v":3.1496062992125984E-2},{"$f":"IF(AND($R32<>\"\",Q32<>\"\"),Q32*VLOOKUP($R32,$A$67:$B$69,2),\"\")","v":0},{"$f":"IF(R32<>\"\",IF(R32=$A$69,$A$68,$A$69),\"\")","v":"inch"}]
["Motor","Mabuchi","FC280SC-20150",null,{"$f":"IF(F33<>\"\",LEFT(F33,1),\"Z\")","v":"M"},"Motor","Motor","MabuchiMotor",null,1.95,100,{"$f":"D33*J33","v":0},"Kysan",{"$f":"VLOOKUP($H33,$A$73:$G$101,2,FALSE)","v":45},{"$f":"VLOOKUP($H33,$A$73:$G$101,3, FALSE)","v":24.2},{"$f":"VLOOKUP($H33,$A$73:$G$101,4,FALSE)","v":18.3},{"$f":"VLOOKUP($H33,$A$73:$G$101,5,TRUE)","v":0},"mm",{"$f":"IF(AND($R33<>\"\",N33<>\"\"),N33*VLOOKUP($R33,$A$67:$B$69,2),\"\")","v":1.7716535433070866},{"$f":"IF(AND($R33<>\"\",O33<>\"\"),O33*VLOOKUP($R33,$A$67:$B$69,2),\"\")","v":0.952755905511811},{"$f":"IF(AND($R33<>\"\",P33<>\"\"),P33*VLOOKUP($R33,$A$67:$B$69,2),\"\")","v":0.72047244094488194},{"$f":"IF(AND($R33<>\"\",Q33<>\"\"),Q33*VLOOKUP($R33,$A$67:$B$69,2),\"\")","v":0},{"$f":"IF(R33<>\"\",IF(R33=$A$69,$A$68,$A$69),\"\")","v":"inch"}]
["Keypad","Fairchild","MMBT3904",{"$f":"1+LEN(F34)-LEN(SUBSTITUTE(F34,\",\",\"\"))","v":1},{"$f":"IF(F34<>\"\",LEFT(F34,1),\"Z\")","v":"Q"},"Q101","NPN, 100 mA, 40v, Beta 100","SOT-23","-55, +150",5.7320000000000003E-2,250,{"$f":"D34*J34","v":5.7320000000000003E-2},"Digi-Key",{"$f":"VLOOKUP($H34,$A$73:$G$101,2,FALSE)","v":3.04},{"$f":"VLOOKUP($H34,$A$73:$G$101,3, FALSE)","v":2.64},{"$f":"VLOOKUP($H34,$A$73:$G$101,4,FALSE)","v":1.22},{"$f":"VLOOKUP($H34,$A$73:$G$101,5,TRUE)","v":0},"mm",{"$f":"IF(AND($R34<>\"\",N34<>\"\"),N34*VLOOKUP($R34,$A$67:$B$69,2),\"\")","v":0.11968503937007874},{"$f":"IF(AND($R34<>\"\",O34<>\"\"),O34*VLOOKUP($R34,$A$67:$B$69,2),\"\")","v":0.10393700787401575},{"$f":"IF(AND($R34<>\"\",P34<>\"\"),P34*VLOOKUP($R34,$A$67:$B$69,2),\"\")","v":4.8031496062992125E-2},{"$f":"IF(AND($R34<>\"\",Q34<>\"\"),Q34*VLOOKUP($R34,$A$67:$B$69,2),\"\")","v":0},{"$f":"IF(R34<>\"\",IF(R34=$A$69,$A$68,$A$69),\"\")","v":"inch"}]
["Keypad","Panasonic","ERJ-2RKF1582X",{"$f":"1+LEN(F35)-LEN(SUBSTITUTE(F35,\",\",\"\"))","v":1},{"$f":"IF(F35<>\"\",LEFT(F35,1),\"Z\")","v":"R"},"R101","15.8K, 0.1W, 1%","0402","-55, +125",1.3639999999999999E-2,250,{"$f":"D35*J35","v":1.3639999999999999E-2},"Digi-Key",{"$f":"VLOOKUP($H35,$A$73:$G$101,2,FALSE)","v":1},{"$f":"VLOOKUP($H35,$A$73:$G$101,3, FALSE)","v":0.5},{"$f":"VLOOKUP($H35,$A$73:$G$101,4,FALSE)","v":0.4},{"$f":"VLOOKUP($H35,$A$73:$G$101,5,TRUE)","v":0},"mm",{"$f":"IF(AND($R35<>\"\",N35<>\"\"),N35*VLOOKUP($R35,$A$67:$B$69,2),\"\")","v":3.937007874015748E-2},{"$f":"IF(AND($R35<>\"\",O35<>\"\"),O35*VLOOKUP($R35,$A$67:$B$69,2),\"\")","v":1.968503937007874E-2},{"$f":"IF(AND($R35<>\"\",P35<>\"\"),P35*VLOOKUP($R35,$A$67:$B$69,2),\"\")","v":1.5748031496062992E-2},{"$f":"IF(AND($R35<>\"\",Q35<>\"\"),Q35*VLOOKUP($R35,$A$67:$B$69,2),\"\")","v":0},{"$f":"IF(R35<>\"\",IF(R35=$A$69,$A$68,$A$69),\"\")","v":"inch"}]
["Keypad","Panasonic","ERJ-2RKF1001X",{"$f":"1+LEN(F36)-LEN(SUBSTITUTE(F36,\",\",\"\"))","v":5},{"$f":"IF(F36<>\"\",LEFT(F36,1),\"Z\")","v":"R"},"R102,R103,R104,R105,R106","1K, 0.1W, 1%","0402","-55, +125",1.3639999999999999E-2,250,{"$f":"D36*J36","v":6.8199999999999997E-2},"Digi-Key",{"$f":"VLOOKUP($H36,$A$73:$G$101,2,FALSE)","v":1},{"$f":"VLOOKUP($H36,$A$73:$G$101,3, FALSE)","v":0.5},{"$f":"VLOOKUP($H36,$A$73:$G$101,4,FALSE)","v":0.4},{"$f":"VLOOKUP($H36,$A$73:$G$101,5,TRUE)","v":0},"mm",{"$f":"IF(AND($R36<>\"\",N36<>\"\"),N36*VLOOKUP($R36,$A$67:$B$69,2),\"\")","v":3.937007874015748E-2},{"$f":"IF(AND($R36<>\"\",O36<>\"\"),O36*VLOOKUP($R36,$A$67:$B$69,2),\"\")","v":1.968503937007874E-2},{"$f":"IF(AND($R36<>\"\",P36<>\"\"),P36*VLOOKUP($R36,$A$67:$B$69,2),\"\")","v":1.5748031496062992E-2},{"$f":"IF(AND($R36<>\"\",Q36<>\"\"),Q36*VLOOKUP($R36,$A$67:$B$69,2),\"\")","v":0},{"$f":"IF(R36<>\"\",IF(R36=$A$69,$A$68,$A$69),\"\")","v":"inch"}]
["Micro","Panasonic","ERJ-2RKF1000X",{"$f":"1+LEN(F37)-LEN(SUBSTITUTE(F37,\",\",\"\"))","v":1},{"$f":"IF(F37<>\"\",LEFT(F37,1),\"Z\")","v":"R"},"R107","100R, 0.1W, 1%","0402","-55, +125",1.3639999999999999E-2,250,{"$f":"D37*J37","v":1.3639999999999999E-2},"Digi-Key",{"$f":"VLOOKUP($H37,$A$73:$G$101,2,FALSE)","v":1},{"$f":"VLOOKUP($H37,$A$73:$G$101,3, FALSE)","v":0.5},{"$f":"VLOOKUP($H37,$A$73:$G$101,4,FALSE)","v":0.4},{"$f":"VLOOKUP($H37,$A$73:$G$101,5,TRUE)","v":0},"mm",{"$f":"IF(AND($R37<>\"\",N37<>\"\"),N37*VLOOKUP($R37,$A$67:$B$69,2),\"\")","v":3.937007874015748E-2},{"$f":"IF(AND($R37<>\"\",O37<>\"\"),O37*VLOOKUP($R37,$A$67:$B$69,2),\"\")","v":1.968503937007874E-2},{"$f":"IF(AND($R37<>\"\",P37<>\"\"),P37*VLOOKUP($R37,$A$67:$B$69,2),\"\")","v":1.5748031496062992E-2},{"$f":"IF(AND($R37<>\"\",Q37<>\"\"),Q37*VLOOKUP($R37,$A$67:$B$69,2),\"\")","v":0},{"$f":"IF(R37<>\"\",IF(R37=$A$69,$A$68,$A$69),\"\")","v":"inch"}]
["Development","Panasonic","ERJ-2RKF3400X",{"$f":"1+LEN(F38)-LEN(SUBSTITUTE(F38,\",\",\"\"))","v":2},{"$f":"IF(F38<>\"\",LEFT(F38,1),\"Z\")","v":"R"},"R109,R110","340R, 0.1W, 1% (DEVELOPMENT)","0402","-55, +125",1.3639999999999999E-2,250,{"$f":"D38*J38","v":2.7279999999999999E-2},"Digi-Key",{"$f":"VLOOKUP($H38,$A$73:$G$101,2,FALSE)","v":1},{"$f":"VLOOKUP($H38,$A$73:$G$101,3, FALSE)","v":0.5},{"$f":"VLOOKUP($H38,$A$73:$G$101,4,FALSE)","v":0.4},{"$f":"VLOOKUP($H38,$A$73:$G$101,5,TRUE)","v":0},"mm",{"$f":"IF(AND($R38<>\"\",N38<>\"\"),N38*VLOOKUP($R38,$A$67:$B$69,2),\"\")","v":3.937007874015748E-2},{"$f":"IF(AND($R38<>\"\",O38<>\"\"),O38*VLOOKUP($R38,$A$67:$B$69,2),\"\")","v":1.968503937007874E-2},{"$f":"IF(AND($R38<>\"\",P38<>\"\"),P38*VLOOKUP($R38,$A$67:$B$69,2),\"\")","v":1.5748031496062992E-2},{"$f":"IF(AND($R38<>\"\",Q38<>\"\"),Q38*VLOOKUP($R38,$A$67:$B$69,2),\"\")","v":0},{"$f":"IF(R38<>\"\",IF(R38=$A$69,$A$68,$A$69),\"\")","v":"inch"}]
["+12v Shutdown","Panasonic","ERJ-2RKF1003X",{"$f":"1+LEN(F39)-LEN(SUBSTITUTE(F39,\",\",\"\"))","v":1},{"$f":"IF(F39<>\"\",LEFT(F39,1),\"Z\")","v":"R"},"R112","100K, 0.1W, 1%","0402","-55, +125",1.3639999999999999E-2,250,{"$f":"D39*J39","v":1.3639999999999999E-2},"Digi-Key",{"$f":"VLOOKUP($H39,$A$73:$G$101,2,FALSE)","v":1},{"$f":"VLOOKUP($H39,$A$73:$G$101,3, FALSE)","v":0.5},{"$f":"VLOOKUP($H39,$A$73:$G$101,4,FALSE)","v":0.4},{"$f":"VLOOKUP($H39,$A$73:$G$101,5,TRUE)","v":0},"mm",{"$f":"IF(AND($R39<>\"\",N39<>\"\"),N39*VLOOKUP($R39,$A$67:$B$69,2),\"\")","v":3.937007874015748E-2},{"$f":"IF(AND($R39<>\"\",O39<>\"\"),O39*VLOOKUP($R39,$A$67:$B$69,2),\"\")","v":1.968503937007874E-2},{"$f":"IF(AND($R39<>\"\",P39<>\"\"),P39*VLOOKUP($R39,$A$67:$B$69,2),\"\")","v":1.5748031496062992E-2},{"$f":"IF(AND($R39<>\"\",Q39<>\"\"),Q39*VLOOKUP($R39,$A$67:$B$69,2),\"\")","v":0},{"$f":"IF(R39<>\"\",IF(R39=$A$69,$A$68,$A$69),\"\")","v":"inch"}]
["Micro","Panasonic","ERJ-2RKF7502X",{"$f":"1+LEN(F40)-LEN(SUBSTITUTE(F40,\",\",\"\"))","v":1},{"$f":"IF(F40<>\"\",LEFT(F40,1),\"Z\")","v":"R"},"R113","75K, 0.1W, 1%","0402","-55, +125",1.3639999999999999E-2,250,{"$f":"D40*J40","v":1.3639999999999999E-2},"Digi-Key",{"$f":"VLOOKUP($H40,$A$73:$G$101,2,FALSE)","v":1},{"$f":"VLOOKUP($H40,$A$73:$G$101,3, FALSE)","v":0.5},{"$f":"VLOOKUP($H40,$A$73:$G$101,4,FALSE)","v":0.4},{"$f":"VLOOKUP($H40,$A$73:$G$101,5,TRUE)","v":0},"mm",{"$f":"IF(AND($R40<>\"\",N40<>\"\"),N40*VLOOKUP($R40,$A$67:$B$69,2),\"\")","v":3.937007874015748E-2},{"$f":"IF(AND($R40<>\"\",O40<>\"\"),O40*VLOOKUP($R40,$A$67:$B$69,2),\"\")","v":1.968503937007874E-2},{"$f":"IF(AND($R40<>\"\",P40<>\"\"),P40*VLOOKUP($R40,$A$67:$B$69,2),\"\")","v":1.5748031496062992E-2},{"$f":"IF(AND($R40<>\"\",Q40<>\"\"),Q40*VLOOKUP($R40,$A$67:$B$69,2),\"\")","v":0},{"$f":"IF(R40<>\"\",IF(R40=$A$69,$A$68,$A$69),\"\")","v":"inch"}]
["Micro","Panasonic","ERJ-2RKF1003X",{"$f":"1+LEN(F41)-LEN(SUBSTITUTE(F41,\",\",\"\"))","v":4},{"$f":"IF(F41<>\"\",LEFT(F41,1),\"Z\")","v":"R"},"R114,R115,R116,R117","100K, 0.1W, 1%","0402","-55, +125",1.3639999999999999E-2,250,{"$f":"D41*J41","v":5.4559999999999997E-2},"Digi-Key",{"$f":"VLOOKUP($H41,$A$73:$G$101,2,FALSE)","v":1},{"$f":"VLOOKUP($H41,$A$73:$G$101,3, FALSE)","v":0.5},{"$f":"VLOOKUP($H41,$A$73:$G$101,4,FALSE)","v":0.4},{"$f":"VLOOKUP($H41,$A$73:$G$101,5,TRUE)","v":0},"mm",{"$f":"IF(AND($R41<>\"\",N41<>\"\"),N41*VLOOKUP($R41,$A$67:$B$69,2),\"\")","v":3.937007874015748E-2},{"$f":"IF(AND($R41<>\"\",O41<>\"\"),O41*VLOOKUP($R41,$A$67:$B$69,2),\"\")","v":1.968503937007874E-2},{"$f":"IF(AND($R41<>\"\",P41<>\"\"),P41*VLOOKUP($R41,$A$67:$B$69,2),\"\")","v":1.5748031496062992E-2},{"$f":"IF(AND($R41<>\"\",Q41<>\"\"),Q41*VLOOKUP($R41,$A$67:$B$69,2),\"\")","v":0},{"$f":"IF(R41<>\"\",IF(R41=$A$69,$A$68,$A$69),\"\")","v":"inch"}]
["Sense","Panasonic","ERJ-2RKF1003X",{"$f":"1+LEN(F42)-LEN(SUBSTITUTE(F42,\",\",\"\"))","v":2},{"$f":"IF(F42<>\"\",LEFT(F42,1),\"Z\")","v":"R"},"R203,R208","100K, 0.1W, 1%","0402","-55, +125",1.3639999999999999E-2,250,{"$f":"D42*J42","v":2.7279999999999999E-2},"Digi-Key",{"$f":"VLOOKUP($H42,$A$73:$G$101,2,FALSE)","v":1},{"$f":"VLOOKUP($H42,$A$73:$G$101,3, FALSE)","v":0.5},{"$f":"VLOOKUP($H42,$A$73:$G$101,4,FALSE)","v":0.4},{"$f":"VLOOKUP($H42,$A$73:$G$101,5,TRUE)","v":0},"mm",{"$f":"IF(AND($R42<>\"\",N42<>\"\"),N42*VLOOKUP($R42,$A$67:$B$69,2),\"\")","v":3.937007874015748E-2},{"$f":"IF(AND($R42<>\"\",O42<>\"\"),O42*VLOOKUP($R42,$A$67:$B$69,2),\"\")","v":1.968503937007874E-2},{"$f":"IF(AND($R42<>\"\",P42<>\"\"),P42*VLOOKUP($R42,$A$67:$B$69,2),\"\")","v":1.5748031496062992E-2},{"$f":"IF(AND($R42<>\"\",Q42<>\"\"),Q42*VLOOKUP($R42,$A$67:$B$69,2),\"\")","v":0},{"$f":"IF(R42<>\"\",IF(R42=$A$69,$A$68,$A$69),\"\")","v":"inch"}]
["Sense","Panasonic","ERJ-2RKF8871X",{"$f":"1+LEN(F43)-LEN(SUBSTITUTE(F43,\",\",\"\"))","v":2},{"$f":"IF(F43<>\"\",LEFT(F43,1),\"Z\")","v":"R"},"R207,R209","8870R, 0.1W, 1%","0402","-55, +125",1.3639999999999999E-2,250,{"$f":"D43*J43","v":2.7279999999999999E-2},"Digi-Key",{"$f":"VLOOKUP($H43,$A$73:$G$101,2,FALSE)","v":1},{"$f":"VLOOKUP($H43,$A$73:$G$101,3, FALSE)","v":0.5},{"$f":"VLOOKUP($H43,$A$73:$G$101,4,FALSE)","v":0.4},{"$f":"VLOOKUP($H43,$A$73:$G$101,5,TRUE)","v":0},"mm",{"$f":"IF(AND($R43<>\"\",N43<>\"\"),N43*VLOOKUP($R43,$A$67:$B$69,2),\"\")","v":3.937007874015748E-2},{"$f":"IF(AND($R43<>\"\",O43<>\"\"),O43*VLOOKUP($R43,$A$67:$B$69,2),\"\")","v":1.968503937007874E-2},{"$f":"IF(AND($R43<>\"\",P43<>\"\"),P43*VLOOKUP($R43,$A$67:$B$69,2),\"\")","v":1.5748031496062992E-2},{"$f":"IF(AND($R43<>\"\",Q43<>\"\"),Q43*VLOOKUP($R43,$A$67:$B$69,2),\"\")","v":0},{"$f":"IF(R43<>\"\",IF(R43=$A$69,$A$68,$A$69),\"\")","v":"inch"}]
["+12v Clean Supply","Panasonic","ERJ-2RKF1433X",{"$f":"1+LEN(F44)-LEN(SUBSTITUTE(F44,\",\",\"\"))","v":1},{"$f":"IF(F44<>\"\",LEFT(F44,1),\"Z\")","v":"R"},"R210","143K, 0.1W, 1%","0402",null,1.3639999999999999E-2,250,{"$f":"D44*J44","v":1.3639999999999999E-2},"Digi-Key",{"$f":"VLOOKUP($H44,$A$73:$G$101,2,FALSE)","v":1},{"$f":"VLOOKUP($H44,$A$73:$G$101,3, FALSE)","v":0.5},{"$f":"VLOOKUP($H44,$A$73:$G$101,4,FALSE)","v":0.4},{"$f":"VLOOKUP($H44,$A$73:$G$101,5,TRUE)","v":0},"mm",{"$f":"IF(AND($R44<>\"\",N44<>\"\"),N44*VLOOKUP($R44,$A$67:$B$69,2),\"\")","v":3.937007874015748E-2},{"$f":"IF(AND($R44<>\"\",O44<>\"\"),O44*VLOOKUP($R44,$A$67:$B$69,2),\"\")","v":1.968503937007874E-2},{"$f":"IF(AND($R44<>\"\",P44<>\"\"),P44*VLOOKUP($R44,$A$67:$B$69,2),\"\")","v":1.5748031496062992E-2},{"$f":"IF(AND($R44<>\"\",Q44<>\"\"),Q44*VLOOKUP($R44,$A$67:$B$69,2),\"\")","v":0},{"$f":"IF(R44<>\"\",IF(R44=$A$69,$A$68,$A$69),\"\")","v":"inch"}]
["+12v Clean Supply","Panasonic","ERJ-2RKF1582X",{"$f":"1+LEN(F45)-LEN(SUBSTITUTE(F45,\",\",\"\"))","v":1},{"$f":"IF(F45<>\"\",LEFT(F45,1),\"Z\")","v":"R"},"R211","15.8K, 0.1W, 1%","0402",null,1.3639999999999999E-2,250,{"$f":"D45*J45","v":1.3639999999999999E-2},"Digi-Key",{"$f":"VLOOKUP($H45,$A$73:$G$101,2,FALSE)","v":1},{"$f":"VLOOKUP($H45,$A$73:$G$101,3, FALSE)","v":0.5},{"$f":"VLOOKUP($H45,$A$73:$G$101,4,FALSE)","v":0.4},{"$f":"VLOOKUP($H45,$A$73:$G$101,5,TRUE)","v":0},"mm",{"$f":"IF(AND($R45<>\"\",N45<>\"\"),N45*VLOOKUP($R45,$A$67:$B$69,2),\"\")","v":3.937007874015748E-2},{"$f":"IF(AND($R45<>\"\",O45<>\"\"),O45*VLOOKUP($R45,$A$67:$B$69,2),\"\")","v":1.968503937007874E-2},{"$f":"IF(AND($R45<>\"\",P45<>\"\"),P45*VLOOKUP($R45,$A$67:$B$69,2),\"\")","v":1.5748031496062992E-2},{"$f":"IF(AND($R45<>\"\",Q45<>\"\"),Q45*VLOOKUP($R45,$A$67:$B$69,2),\"\")","v":0},{"$f":"IF(R45<>\"\",IF(R45=$A$69,$A$68,$A$69),\"\")","v":"inch"}]
["+12v Supply","Panasonic","ERJ-2RKF1001X",{"$f":"1+LEN(F46)-LEN(SUBSTITUTE(F46,\",\",\"\"))","v":1},{"$f":"IF(F46<>\"\",LEFT(F46,1),\"Z\")","v":"R"},"R212","1K, 0.1W, 1%","0402","-55, +125",1.3639999999999999E-2,250,{"$f":"D46*J46","v":1.3639999999999999E-2},"Digi-Key",{"$f":"VLOOKUP($H46,$A$73:$G$101,2,FALSE)","v":1},{"$f":"VLOOKUP($H46,$A$73:$G$101,3, FALSE)","v":0.5},{"$f":"VLOOKUP($H46,$A$73:$G$101,4,FALSE)","v":0.4},{"$f":"VLOOKUP($H46,$A$73:$G$101,5,TRUE)","v":0},"mm",{"$f":"IF(AND($R46<>\"\",N46<>\"\"),N46*VLOOKUP($R46,$A$67:$B$69,2),\"\")","v":3.937007874015748E-2},{"$f":"IF(AND($R46<>\"\",O46<>\"\"),O46*VLOOKUP($R46,$A$67:$B$69,2),\"\")","v":1.968503937007874E-2},{"$f":"IF(AND($R46<>\"\",P46<>\"\"),P46*VLOOKUP($R46,$A$67:$B$69,2),\"\")","v":1.5748031496062992E-2},{"$f":"IF(AND($R46<>\"\",Q46<>\"\"),Q46*VLOOKUP($R46,$A$67:$B$69,2),\"\")","v":0},{"$f":"IF(R46<>\"\",IF(R46=$A$69,$A$68,$A$69),\"\")","v":"inch"}]
["+12v Supply","Panasonic","ERJ-2RKF1003X",{"$f":"1+LEN(F47)-LEN(SUBSTITUTE(F47,\",\",\"\"))","v":1},{"$f":"IF(F47<>\"\",LEFT(F47,1),\"Z\")","v":"R"},"R213","100K, 0.1W, 1%","0402","-55, +125",1.3639999999999999E-2,250,{"$f":"D47*J47","v":1.3639999999999999E-2},"Digi-Key",{"$f":"VLOOKUP($H47,$A$73:$G$101,2,FALSE)","v":1},{"$f":"VLOOKUP($H47,$A$73:$G$101,3, FALSE)","v":0.5},{"$f":"VLOOKUP($H47,$A$73:$G$101,4,FALSE)","v":0.4},{"$f":"VLOOKUP($H47,$A$73:$G$101,5,TRUE)","v":0},"mm",{"$f":"IF(AND($R47<>\"\",N47<>\"\"),N47*VLOOKUP($R47,$A$67:$B$69,2),\"\")","v":3.937007874015748E-2},{"$f":"IF(AND($R47<>\"\",O47<>\"\"),O47*VLOOKUP($R47,$A$67:$B$69,2),\"\")","v":1.968503937007874E-2},{"$f":"IF(AND($R47<>\"\",P47<>\"\"),P47*VLOOKUP($R47,$A$67:$B$69,2),\"\")","v":1.5748031496062992E-2},{"$f":"IF(AND($R47<>\"\",Q47<>\"\"),Q47*VLOOKUP($R47,$A$67:$B$69,2),\"\")","v":0},{"$f":"IF(R47<>\"\",IF(R47=$A$69,$A$68,$A$69),\"\")","v":"inch"}]
["+12v Supply","Panasonic","ERJ-2RKF2152X",{"$f":"1+LEN(F48)-LEN(SUBSTITUTE(F48,\",\",\"\"))","v":1},{"$f":"IF(F48<>\"\",LEFT(F48,1),\"Z\")","v":"R"},"R214","21.5K, 0.1W, 1%","0402",null,1.3639999999999999E-2,250,{"$f":"D48*J48","v":1.3639999999999999E-2},"Digi-Key",{"$f":"VLOOKUP($H48,$A$73:$G$101,2,FALSE)","v":1},{"$f":"VLOOKUP($H48,$A$73:$G$101,3, FALSE)","v":0.5},{"$f":"VLOOKUP($H48,$A$73:$G$101,4,FALSE)","v":0.4},{"$f":"VLOOKUP($H48,$A$73:$G$101,5,TRUE)","v":0},"mm",{"$f":"IF(AND($R48<>\"\",N48<>\"\"),N48*VLOOKUP($R48,$A$67:$B$69,2),\"\")","v":3.937007874015748E-2},{"$f":"IF(AND($R48<>\"\",O48<>\"\"),O48*VLOOKUP($R48,$A$67:$B$69,2),\"\")","v":1.968503937007874E-2},{"$f":"IF(AND($R48<>\"\",P48<>\"\"),P48*VLOOKUP($R48,$A$67:$B$69,2),\"\")","v":1.5748031496062992E-2},{"$f":"IF(AND($R48<>\"\",Q48<>\"\"),Q48*VLOOKUP($R48,$A$67:$B$69,2),\"\")","v":0},{"$f":"IF(R48<>\"\",IF(R48=$A$69,$A$68,$A$69),\"\")","v":"inch"}]
["+12v Supply","Panasonic","ERJ-2RKF3483X",{"$f":"1+LEN(F49)-LEN(SUBSTITUTE(F49,\",\",\"\"))","v":1},{"$f":"IF(F49<>\"\",LEFT(F49,1),\"Z\")","v":"R"},"R215","348K, 0.1W, 1%","0402",null,1.3639999999999999E-2,250,{"$f":"D49*J49","v":1.3639999999999999E-2},"Digi-Key",{"$f":"VLOOKUP($H49,$A$73:$G$101,2,FALSE)","v":1},{"$f":"VLOOKUP($H49,$A$73:$G$101,3, FALSE)","v":0.5},{"$f":"VLOOKUP($H49,$A$73:$G$101,4,FALSE)","v":0.4},{"$f":"VLOOKUP($H49,$A$73:$G$101,5,TRUE)","v":0},"mm",{"$f":"IF(AND($R49<>\"\",N49<>\"\"),N49*VLOOKUP($R49,$A$67:$B$69,2),\"\")","v":3.937007874015748E-2},{"$f":"IF(AND($R49<>\"\",O49<>\"\"),O49*VLOOKUP($R49,$A$67:$B$69,2),\"\")","v":1.968503937007874E-2},{"$f":"IF(AND($R49<>\"\",P49<>\"\"),P49*VLOOKUP($R49,$A$67:$B$69,2),\"\")","v":1.5748031496062992E-2},{"$f":"IF(AND($R49<>\"\",Q49<>\"\"),Q49*VLOOKUP($R49,$A$67:$B$69,2),\"\")","v":0},{"$f":"IF(R49<>\"\",IF(R49=$A$69,$A$68,$A$69),\"\")","v":"inch"}]
["+12v Supply","Panasonic","ERJ-2RKF7322X",{"$f":"1+LEN(F50)-LEN(SUBSTITUTE(F50,\",\",\"\"))","v":1},{"$f":"IF(F50<>\"\",LEFT(F50,1),\"Z\")","v":"R"},"R216","73.2K, 0.1W, 1%","0402",null,1.3639999999999999E-2,250,{"$f":"D50*J50","v":1.3639999999999999E-2},"Digi-Key",{"$f":"VLOOKUP($H50,$A$73:$G$101,2,FALSE)","v":1},{"$f":"VLOOKUP($H50,$A$73:$G$101,3, FALSE)","v":0.5},{"$f":"VLOOKUP($H50,$A$73:$G$101,4,FALSE)","v":0.4},{"$f":"VLOOKUP($H50,$A$73:$G$101,5,TRUE)","v":0},"mm",{"$f":"IF(AND($R50<>\"\",N50<>\"\"),N50*VLOOKUP($R50,$A$67:$B$69,2),\"\")","v":3.937007874015748E-2},{"$f":"IF(AND($R50<>\"\",O50<>\"\"),O50*VLOOKUP($R50,$A$67:$B$69,2),\"\")","v":1.968503937007874E-2},{"$f":"IF(AND($R50<>\"\",P50<>\"\"),P50*VLOOKUP($R50,$A$67:$B$69,2),\"\")","v":1.5748031496062992E-2},{"$f":"IF(AND($R50<>\"\",Q50<>\"\"),Q50*VLOOKUP($R50,$A$67:$B$69,2),\"\")","v":0},{"$f":"IF(R50<>\"\",IF(R50=$A$69,$A$68,$A$69),\"\")","v":"inch"}]
["+12v Supply","Panasonic","ERJ-2RKF3832X",{"$f":"1+LEN(F51)-LEN(SUBSTITUTE(F51,\",\",\"\"))","v":1},{"$f":"IF(F51<>\"\",LEFT(F51,1),\"Z\")","v":"R"},"R217","38.3K, 0.1W, 1%","0402",null,1.3639999999999999E-2,250,{"$f":"D51*J51","v":1.3639999999999999E-2},"Digi-Key",{"$f":"VLOOKUP($H51,$A$73:$G$101,2,FALSE)","v":1},{"$f":"VLOOKUP($H51,$A$73:$G$101,3, FALSE)","v":0.5},{"$f":"VLOOKUP($H51,$A$73:$G$101,4,FALSE)","v":0.4},{"$f":"VLOOKUP($H51,$A$73:$G$101,5,TRUE)","v":0},"mm",{"$f":"IF(AND($R51<>\"\",N51<>\"\"),N51*VLOOKUP($R51,$A$67:$B$69,2),\"\")","v":3.937007874015748E-2},{"$f":"IF(AND($R51<>\"\",O51<>\"\"),O51*VLOOKUP($R51,$A$67:$B$69,2),\"\")","v":1.968503937007874E-2},{"$f":"IF(AND($R51<>\"\",P51<>\"\"),P51*VLOOKUP($R51,$A$67:$B$69,2),\"\")","v":1.5748031496062992E-2},{"$f":"IF(AND($R51<>\"\",Q51<>\"\"),Q51*VLOOKUP($R51,$A$67:$B$69,2),\"\")","v":0},{"$f":"IF(R51<>\"\",IF(R51=$A$69,$A$68,$A$69),\"\")","v":"inch"}]
["Motor","Panasonic","ERJ-2RKF7502X",{"$f":"1+LEN(F52)-LEN(SUBSTITUTE(F52,\",\",\"\"))","v":1},{"$f":"IF(F52<>\"\",LEFT(F52,1),\"Z\")","v":"R"},"R301","75K, 0.1W, 1%","0402","-55, +125",1.3639999999999999E-2,250,{"$f":"D52*J52","v":1.3639999999999999E-2},"Digi-Key",{"$f":"VLOOKUP($H52,$A$73:$G$101,2,FALSE)","v":1},{"$f":"VLOOKUP($H52,$A$73:$G$101,3, FALSE)","v":0.5},{"$f":"VLOOKUP($H52,$A$73:$G$101,4,FALSE)","v":0.4},{"$f":"VLOOKUP($H52,$A$73:$G$101,5,TRUE)","v":0},"mm",{"$f":"IF(AND($R52<>\"\",N52<>\"\"),N52*VLOOKUP($R52,$A$67:$B$69,2),\"\")","v":3.937007874015748E-2},{"$f":"IF(AND($R52<>\"\",O52<>\"\"),O52*VLOOKUP($R52,$A$67:$B$69,2),\"\")","v":1.968503937007874E-2},{"$f":"IF(AND($R52<>\"\",P52<>\"\"),P52*VLOOKUP($R52,$A$67:$B$69,2),\"\")","v":1.5748031496062992E-2},{"$f":"IF(AND($R52<>\"\",Q52<>\"\"),Q52*VLOOKUP($R52,$A$67:$B$69,2),\"\")","v":0},{"$f":"IF(R52<>\"\",IF(R52=$A$69,$A$68,$A$69),\"\")","v":"inch"}]
["LIN","Panasonic","ERJ-2RKF1003X",{"$f":"1+LEN(F53)-LEN(SUBSTITUTE(F53,\",\",\"\"))","v":1},{"$f":"IF(F53<>\"\",LEFT(F53,1),\"Z\")","v":"R"},"R303","100K, 0.1W, 1%","0402","-55, +125",1.3639999999999999E-2,250,{"$f":"D53*J53","v":1.3639999999999999E-2},"Digi-Key",{"$f":"VLOOKUP($H53,$A$73:$G$101,2,FALSE)","v":1},{"$f":"VLOOKUP($H53,$A$73:$G$101,3, FALSE)","v":0.5},{"$f":"VLOOKUP($H53,$A$73:$G$101,4,FALSE)","v":0.4},{"$f":"VLOOKUP($H53,$A$73:$G$101,5,TRUE)","v":0},"mm",{"$f":"IF(AND($R53<>\"\",N53<>\"\"),N53*VLOOKUP($R53,$A$67:$B$69,2),\"\")","v":3.937007874015748E-2},{"$f":"IF(AND($R53<>\"\",O53<>\"\"),O53*VLOOKUP($R53,$A$67:$B$69,2),\"\")","v":1.968503937007874E-2},{"$f":"IF(AND($R53<>\"\",P53<>\"\"),P53*VLOOKUP($R53,$A$67:$B$69,2),\"\")","v":1.5748031496062992E-2},{"$f":"IF(AND($R53<>\"\",Q53<>\"\"),Q53*VLOOKUP($R53,$A$67:$B$69,2),\"\")","v":0},{"$f":"IF(R53<>\"\",IF(R53=$A$69,$A$68,$A$69),\"\")","v":"inch"}]
["Motor","Panasonic","ERJ-2RKF1582X",{"$f":"1+LEN(F54)-LEN(SUBSTITUTE(F54,\",\",\"\"))","v":2},{"$f":"IF(F54<>\"\",LEFT(F54,1),\"Z\")","v":"R"},"R305,R306","15.8K, 0.1W, 1%","0402",null,1.3639999999999999E-2,250,{"$f":"D54*J54","v":2.7279999999999999E-2},"Digi-Key",{"$f":"VLOOKUP($H54,$A$73:$G$101,2,FALSE)","v":1},{"$f":"VLOOKUP($H54,$A$73:$G$101,3, FALSE)","v":0.5},{"$f":"VLOOKUP($H54,$A$73:$G$101,4,FALSE)","v":0.4},{"$f":"VLOOKUP($H54,$A$73:$G$101,5,TRUE)","v":0},"mm",{"$f":"IF(AND($R54<>\"\",N54<>\"\"),N54*VLOOKUP($R54,$A$67:$B$69,2),\"\")","v":3.937007874015748E-2},{"$f":"IF(AND($R54<>\"\",O54<>\"\"),O54*VLOOKUP($R54,$A$67:$B$69,2),\"\")","v":1.968503937007874E-2},{"$f":"IF(AND($R54<>\"\",P54<>\"\"),P54*VLOOKUP($R54,$A$67:$B$69,2),\"\")","v":1.5748031496062992E-2},{"$f":"IF(AND($R54<>\"\",Q54<>\"\"),Q54*VLOOKUP($R54,$A$67:$B$69,2),\"\")","v":0},{"$f":"IF(R54<>\"\",IF(R54=$A$69,$A$68,$A$69),\"\")","v":"inch"}]
["+12v Supply","Taiyo Yuden","NS12575T220MN",{"$f":"1+LEN(F55)-LEN(SUBSTITUTE(F55,\",\",\"\"))","v":1},{"$f":"IF(F55<>\"\",LEFT(F55,1),\"Z\")","v":"T"},"T201","22uH, 31mOhm, 4.05A (5.56A Sat)","NS12575","-40, +125",1.47,100,{"$f":"D55*J55","v":1.47},"Digi-Key",{"$f":"VLOOKUP($H55,$A$73:$G$101,2,FALSE)","v":12.5},{"$f":"VLOOKUP($H55,$A$73:$G$101,3, FALSE)","v":12.5},{"$f":"VLOOKUP($H55,$A$73:$G$101,4,FALSE)","v":7.5},{"$f":"VLOOKUP($H55,$A$73:$G$101,5,TRUE)","v":0},"mm",{"$f":"IF(AND($R55<>\"\",N55<>\"\"),N55*VLOOKUP($R55,$A$67:$B$69,2),\"\")","v":0.49212598425196852},{"$f":"IF(AND($R55<>\"\",O55<>\"\"),O55*VLOOKUP($R55,$A$67:$B$69,2),\"\")","v":0.49212598425196852},{"$f":"IF(AND($R55<>\"\",P55<>\"\"),P55*VLOOKUP($R55,$A$67:$B$69,2),\"\")","v":0.29527559055118108},{"$f":"IF(AND($R55<>\"\",Q55<>\"\"),Q55*VLOOKUP($R55,$A$67:$B$69,2),\"\")","v":0},{"$f":"IF(R55<>\"\",IF(R55=$A$69,$A$68,$A$69),\"\")","v":"inch"}]
[null,null,null,null,{"$f":"IF(F56<>\"\",LEFT(F56,1),\"Z\")","v":"Z"},null,null,null,null,null,null,{"$f":"D56*J56","v":0},null,null,null,null,null,null,{"$f":"IF(AND($R56<>\"\",N56<>\"\"),N56*VLOOKUP($R56,$A$67:$B$69,2),\"\")","v":""},{"$f":"IF(AND($R56<>\"\",O56<>\"\"),O56*VLOOKUP($R56,$A$67:$B$69,2),\"\")","v":""},{"$f":"IF(AND($R56<>\"\",P56<>\"\"),P56*VLOOKUP($R56,$A$67:$B$69,2),\"\")","v":""},{"$f":"IF(AND($R56<>\"\",Q56<>\"\"),Q56*VLOOKUP($R56,$A$67:$B$69,2),\"\")","v":""},{"$f":"IF(R56<>\"\",IF(R56=$A$69,$A$68,$A$69),\"\")","v":""}]
[null,null,null,null,{"$f":"IF(F57<>\"\",LEFT(F57,1),\"Z\")","v":"Z"},null,null,null,null,null,null,{"$f":"D57*J57","v":0},null,null,null,null,null,null,{"$f":"IF(AND($R57<>\"\",N57<>\"\"),N57*VLOOKUP($R57,$A$67:$B$69,2),\"\")","v":""},{"$f":"IF(AND($R57<>\"\",O57<>\"\"),O57*VLOOKUP($R57,$A$67:$B$69,2),\"\")","v":""},{"$f":"IF(AND($R57<>\"\",P57<>\"\"),P57*VLOOKUP($R57,$A$67:$B$69,2),\"\")","v":""},{"$f":"IF(AND($R57<>\"\",Q57<>\"\"),Q57*VLOOKUP($R57,$A$67:$B$69,2),\"\")","v":""},{"$f":"IF(R57<>\"\",IF(R57=$A$69,$A$68,$A$69),\"\")","v":""}]
[null,null,null,null,{"$f":"IF(F58<>\"\",LEFT(F58,1),\"Z\")","v":"Z"},null,null,null,null,null,null,{"$f":"D58*J58","v":0},null,null,null,null,null,null,{"$f":"IF(AND($R58<>\"\",N58<>\"\"),N58*VLOOKUP($R58,$A$67:$B$69,2),\"\")","v":""},{"$f":"IF(AND($R58<>\"\",O58<>\"\"),O58*VLOOKUP($R58,$A$67:$B$69,2),\"\")","v":""},{"$f":"IF(AND($R58<>\"\",P58<>\"\"),P58*VLOOKUP($R58,$A$67:$B$69,2),\"\")","v":""},{"$f":"IF(AND($R58<>\"\",Q58<>\"\"),Q58*VLOOKUP($R58,$A$67:$B$69,2),\"\")","v":""},{"$f":"IF(R58<>\"\",IF(R58=$A$69,$A$68,$A$69),\"\")","v":""}]
[null,null,null,null,{"$f":"IF(F59<>\"\",LEFT(F59,1),\"Z\")","v":"Z"},null,null,null,null,null,null,{"$f":"D59*J59","v":0},null,null,null,null,null,null,{"$f":"IF(AND($R59<>\"\",N59<>\"\"),N59*VLOOKUP($R59,$A$67:$B$69,2),\"\")","v":""},{"$f":"IF(AND($R59<>\"\",O59<>\"\"),O59*VLOOKUP($R59,$A$67:$B$69,2),\"\")","v":""},{"$f":"IF(AND($R59<>\"\",P59<>\"\"),P59*VLOOKUP($R59,$A$67:$B$69,2),\"\")","v":""},{"$f":"IF(AND($R59<>\"\",Q59<>\"\"),Q59*VLOOKUP($R59,$A$67:$B$69,2),\"\")","v":""},{"$f":"IF(R59<>\"\",IF(R59=$A$69,$A$68,$A$69),\"\")","v":""}]
[null,null,null,null,{"$f":"IF(F60<>\"\",LEFT(F60,1),\"Z\")","v":"Z"},null,null,null,null,null,null,{"$f":"D60*J60","v":0},null,null,null,null,null,null,{"$f":"IF(AND($R60<>\"\",N60<>\"\"),N60*VLOOKUP($R60,$A$67:$B$69,2),\"\")","v":""},{"$f":"IF(AND($R60<>\"\",O60<>\"\"),O60*VLOOKUP($R60,$A$67:$B$69,2),\"\")","v":""},{"$f":"IF(AND($R60<>\"\",P60<>\"\"),P60*VLOOKUP($R60,$A$67:$B$69,2),\"\")","v":""},{"$f":"IF(AND($R60<>\"\",Q60<>\"\"),Q60*VLOOKUP($R60,$A$67:$B$69,2),\"\")","v":""},{"$f":"IF(R60<>\"\",IF(R60=$A$69,$A$68,$A$69),\"\")","v":""}]
[null,null,null,null,{"$f":"IF(F61<>\"\",LEFT(F61,1),\"Z\")","v":"Z"},null,null,null,null,null,null,{"$f":"D61*J61","v":0},null,null,null,null,null,null,{"$f":"IF(AND($R61<>\"\",N61<>\"\"),N61*VLOOKUP($R61,$A$67:$B$69,2),\"\")","v":""},{"$f":"IF(AND($R61<>\"\",O61<>\"\"),O61*VLOOKUP($R61,$A$67:$B$69,2),\"\")","v":""},{"$f":"IF(AND($R61<>\"\",P61<>\"\"),P61*VLOOKUP($R61,$A$67:$B$69,2),\"\")","v":""},{"$f":"IF(AND($R61<>\"\",Q61<>\"\"),Q61*VLOOKUP($R61,$A$67:$B$69,2),\"\")","v":""},{"$f":"IF(R61<>\"\",IF(R61=$A$69,$A$68,$A$69),\"\")","v":""}]
[null,null,null,null,{"$f":"IF(F62<>\"\",LEFT(F62,1),\"Z\")","v":"Z"},null,null,null,null,null,null,{"$f":"D62*J62","v":0},null,null,null,null,null,null,{"$f":"IF(AND($R62<>\"\",N62<>\"\"),N62*VLOOKUP($R62,$A$67:$B$69,2),\"\")","v":""},{"$f":"IF(AND($R62<>\"\",O62<>\"\"),O62*VLOOKUP($R62,$A$67:$B$69,2),\"\")","v":""},{"$f":"IF(AND($R62<>\"\",P62<>\"\"),P62*VLOOKUP($R62,$A$67:$B$69,2),\"\")","v":""},{"$f":"IF(AND($R62<>\"\",Q62<>\"\"),Q62*VLOOKUP($R62,$A$67:$B$69,2),\"\")","v":""},{"$f":"IF(R62<>\"\",IF(R62=$A$69,$A$68,$A$69),\"\")","v":""}]
[null,null,null,null,{"$f":"IF(F63<>\"\",LEFT(F63,1),\"Z\")","v":"Z"}]
[null,null,null,null,null,null,null,null,null,null,"Total",{"$f":"SUM(L2:L63)","v":26.457399999999982}]
[]
[null,null,null,null,null,null,null,null,null,null,null,null,null,"Max Height",null,9.6519999999999992,null,"mm"]
["Unit Lookup","To alternate",null,null,null,null,null,null,null,null,null,null,null,"Max Depth",null,1.5,1.5,"mm"]
["inch",{"$f":"1/B69","v":25.4}]
["mm",{"$f":"1/25.4","v":3.937007874015748E-2}]
[]
[]
["Package","Length","Width","Height",null,"Depth","Units"]
["0402",1,0.5,0.4,null,null,"mm"]
["0402T",1,0.5,0.55000000000000004,null,null,"mm"]
["0603",1.6,0.8,0.8,null,null,"mm"]
["0805",2,1.25,1.45,null,null,"mm"]
["1206",3.2,1.6,0.7,null,null,"mm"]
["1210",3.2,2.44,2.8,null,null,"mm"]
["2220",5.7,5,2.5,null,null,"mm"]
["26-WFQFN ",6,4,0.74,null,null,"mm"]
["8-SOIC",5,6,1.75,null,null,"mm"]
["CAN SMD-4",4,4,5.4,null,null,"mm"]
["CAN SMD-6",6.3,6.3,5.8,null,null,"mm"]
["CAN SMD-8",8,8,6.2,null,null,"mm"]
["CAN SMD-8T",8,8,10.199999999999999,null,null,"mm"]
["MabuchiMotor",45,24.2,18.3,null,null,"mm"]
["Mallory",14,14,7.7,null,6.7,"mm"]
["MSOP-8",5,3,1.1000000000000001,null,null,"mm"]
["NS12575",12.5,12.5,7.5,null,null,"mm"]
["SC88A",5,6,1.75,null,null,"mm"]
["SFW8S",14.4,3.6,5.3,null,null,"mm"]
["SMB",7.1,6.1,2.41,null,null,"mm"]
["SMC",2.1,2,5.3,null,null,"mm"]
["SMD",2.1,2,5.3,null,null,"mm"]
["SOIC-28",17.899999999999999,10.3,2.65,null,null,"mm"]
["SOT-223",6.5,7,1.7,null,null,"mm"]
["SOT-23",3.04,2.64,1.22,null,null,"mm"]
["SOT-23-5",3.04,3,1.3,null,null,"mm"]
["Sullins-6PS",4.21,3.1,4.5,null,null,"mm"]
["TO-263",15,10,4.4000000000000004,null,null,"mm"]
["Z - Last Row",0,0,0,null,null,"mm"]
[]
[]
[]
["Row Labels","Sum of Est. Cost"]
["+12v Supply",8.5420400000000036]
["+3.3v Supply",0.71035999999999999]
["Keypad",0.65860000000000007]
["LIN",1.3969400000000003]
["Micro",2.7512800000000004]
["Motor",7.4493400000000003]
["Sense",7.016E-2]
["Wake Out",1.5030999999999999]
["(blank)"]
["+12v Shutdown",4.0919999999999998E-2]
["+12v Clean Supply",3.1030400000000005]
["Development",0.15264]
["Acoustic",2.2767599999999999]
["LIN Master",6.3119999999999996E-2]
["Grand Total",28.718300000000006]

{"sheet":"LT3690 PS","index":2,"n_rows":132,"n_cols":6,"rows_kept":132,"cut":false,"hidden":false,"merged":[]}
["Signal","Value","Units","Notes",null,"Based on LT3690"]
["V-IN",28,"v","Typical V-in"]
["V-IN Max",36,"v","Overload shutdown"]
[]
["V-OUT Target",8,"v"]
["Vin Low",9,"v"]
["RT [R21]",72900,"ohms"]
["R4 (FB to Gnd - R22)",38300,"ohms","R4 is data sheet reference"]
["R3 (Out to FB - R23)",{"$f":"B8*(V_OUT/V_FB-1)","v":344700},"ohms","R3 is data sheet reference"]
[{"$f":"A8 & \" => 1%\"","v":"R4 (FB to Gnd - R22) => 1%"},{"$f":"Resistor((B8))","v":38300},"ohms","Selected Resistor Value"]
[{"$f":"A9 & \" => 1%\"","v":"R3 (Out to FB - R23) => 1%"},{"$f":"Resistor((B9))","v":348000},"ohms","Selected Resistor Value"]
[{"$f":"A7 & \" => 1%\"","v":"RT [R21] => 1%"},{"$f":"Resistor((RT))","v":73200},"ohms","Selected Resistor Value"]
["V-FB",0.8,"v"]
["V-SW",0.37,"v"]
["V-LS",0.12,"v"]
["T-ON(min)",0.25,"usec"]
["T-OFF(min)",0.21,"usec"]
["Fsw(max)",{"$f":"(V_OUT+V_LS)/(0.000001*T_ON*(V_IN-V_SW+V_LS))/1000000","v":1.1704504504504505},"MHz","Highest acceptible frequency"]
["Freq (Select)",{"$f":"VLOOKUP(RT,A33:B47,2)","v":0.3},"MHz","Chosen frequency"]
["DC-min",{"$f":"F_Select*0.000001*T_ON*1000000","v":7.4999999999999997E-2},"% duty cycle"]
["DC-max",{"$f":"1-1000000*F_Select*0.000001*T_OFF","v":0.93700000000000006},"% duty cycle"]
["V-IN(min)",{"$f":"(V_OUT+V_LS)/(1-1000000*F_Select*0.000001*T_OFF)-V_LS+V_SW","v":8.9159551760939149},"v by duty cycle"]
["V-IN(max)",{"$f":"(V_OUT+V_LS)/(1000000*F_Select*0.000001*T_ON)-V_LS+V_SW","v":108.51666666666667},"v by duty cycle"]
["I-L(peak)",{"$f":"8+(V_IN_OVERLOAD-V_OUT)/(0.000001*Inductance)*0.000001*T_ON","v":8.3860010293360787},"A"]
["L - Inductor",{"$f":"(V_OUT+V_LS)*0.67/F_Select","v":18.134666666666664},"uHenry","Target Value"]
["Lmin - Inductor (min)",{"$f":"(V_OUT +V_LS)*0.42/F_Select","v":11.367999999999999},"uHenry","Minimum value"]
["I-L(Peak to peak ripple)",{"$f":"(1-10%)*(V_OUT+V_LS)/(B25*F_SW)","v":0.34429913241673404},"A"]
["C-OUT (output cap)",{"$f":"150/(V_OUT*F_SW)","v":16.019473522167488},"uF","(X5R or X7R ceramic best) or Electrolytic with ESR <= 0.03ohm"]
["C-Soft Start",{"$f":"B28/10000","v":1.6019473522167487E-3},"uF"]
["T-Ramp",{"$f":"B29*0.8/0.000002","v":640.77894088669962},"usec"]
[]
["Rt","MHz"]
[9590,1.5]
[10600,1.4]
[11800,1.3]
[13300,1.2]
[15000,1.1000000000000001]
[17000,1]
[19600,0.9]
[22700,0.8]
[26800,0.7]
[32400,0.6]
[40200,0.5]
[52200,0.4]
[72900,0.3]
[117000,0.2]
[164000,0.15]
[]
[]
[]
[]
[]
["SS","Cout","L"]
[".001uF","10 uF","18 uH"]
[]
[]
[]
[]
[]
[]
[]
[]
[]
[]
[]
[]
[]
[]
[]
[]
[]
[]
[]
[]
[]
[]
[]
[]
[]
[".001uF","10 uF","12 uH"]
[]
[]
[]
[]
[]
[]
[]
[]
[]
[]
[]
[]
[]
[]
[]
[]
[]
[]
[]
[]
[]
[]
[]
[]
[]
[".0001 uF","10 uF","12uH"]
[]
[]
[]
[]
[]
[]
[]
[]
[]
[]
[]
[]
[]
[]
[]
[]
[]
[]
[]
[]
[]
[]
[]
[]
[]
[".001uF","10 uF","27 uH"]

{"sheet":"PCB Mech","index":3,"n_rows":28,"n_cols":15,"rows_kept":28,"cut":false,"hidden":false,"merged":[]}
["Origin for PCB","Lower left corner",null,"from 5 Jan 2012 email",null,null,null,null,null,null,"Values","mm","Value","in"]
["PCB width",1.179,"in",null,null,null,null,null,null,null,25.4,"mm",{"$f":"K2/25.4","v":1},"in","test"]
["PCB height",3.25,"in",null,null,null,null,null,null,null,4.0339999999999998,"mm",{"$f":"K3/25.4","v":0.15881889763779528},"in","Ledge Diameter"]
["Hole 1 x (bottom left)",{"$f":"B2/2-0.315","v":0.27450000000000002},null,null,null,null,null,null,null,null,2.7330000000000001,"mm",0.10759842519685041,"in","Post Diameter"]
["Hole 1 y",{"$f":"(B3-2.972)/2","v":0.13900000000000001},null,null,null,null,null,null,null,null,5,"mm",0.19685039370078741,"in","Ramp width"]
["Hole 2 x (top-left)",{"$f":"B4","v":0.27450000000000002},null,null,null,null,null,null,null,null,25.637,"mm",1.0093307086614174,"in","lower post to lower diag rib"]
["Hole 2 y",{"$f":"B5+2.972","v":3.1109999999999998},null,null,null,null,null,null,null,null,3.262,"mm",0.12842519685039372,"in",{"$f":"1.139+0.128","v":1.2669999999999999}]
["Hole 3 x (top-right)",{"$f":"B4+0.6299","v":0.90440000000000009},null,null,null,null,null,null,null,null,23.95,"mm",0.94291338582677164,"in",{"$f":"3.111-M8","v":2.1680866141732285}]
["Hole 3 y",{"$f":"B7","v":3.1109999999999998},null,null,null,null,null,null,null,null,12.9,"mm",0.50787401574803159,"in"]
["Hole 4 x (bottom-right)",{"$f":"B8","v":0.90440000000000009}]
["Hole 4 y",{"$f":"B5","v":0.13900000000000001}]
["notch 1 x (center)",{"$f":"B2/2-0.646","v":-5.6499999999999995E-2}]
["notch 1 y",2.3250000000000002]
["notch 2 x",{"$f":"B2/2+0.648","v":1.2375}]
["notch 2 y",{"$f":"B13","v":2.3250000000000002}]
[]
[]
[]
[]
[]
[]
[]
[]
[]
[]
[]
[]
[null,null,null,null,"image is not quite symmetrical"]

{"sheet":"PIC Load Dump","index":4,"n_rows":33,"n_cols":14,"rows_kept":33,"cut":false,"hidden":false,"merged":[]}
["Signal","Value","Units","Notes",null,"VDD","DAC Count","DAC V","Equiv Bat"]
["Battery",32,"v",null,null,3.3,0,{"$f":"($F$2*G2/2^5)","v":0},{"$f":"H2*($B$3+$B$4)/$B$4","v":0},null,"Signal","Value","Units","Notes"]
["R16",100000,"ohm",null,null,null,1,0.10312499999999999,{"$f":"H3*($B$3+$B$4)/$B$4","v":1.2657518320180383},null,"R5",100000,"Ohms"]
["R20",8870,"ohm",null,null,null,2,0.20624999999999999,{"$f":"H4*($B$3+$B$4)/$B$4","v":2.5315036640360766},null,"R6",100000,"Ohms"]
["V analog in",{"$f":"B2*B4/(B3+B4)","v":2.6071461375952971},"v",null,null,null,3,0.30937499999999996,3.7972554960541141,null,"V-Level",{"$f":"B6*L4/(L3+L4)","v":1.65},"v"]
["V Ref",3.3,"v",null,null,null,4,0.41249999999999998,5.0630073280721533,null,"I R5-R6",{"$f":"1000*B6/(L3+L4)","v":1.6500000000000001E-2},"mA"]
["A/D",{"$f":"B5/B6*2^12","v":3236.0213877546475},"Counts",null,null,null,5,0.515625,6.3287591600901916]
[null,null,null,null,null,null,6,0.61874999999999991,7.5945109921082281]
["R16 Nearest 1%",{"$f":"Resistor(B3)","v":100000},"ohm",null,null,null,7,0.72187499999999993,8.8602628241262682]
["R20 Nearest 1%",{"$f":"Resistor((B4))","v":8870},"ohm",null,null,null,8,0.82499999999999996,10.126014656144307]
[null,null,null,null,null,null,9,0.92812499999999998,11.391766488162345]
[null,null,null,null,null,null,10,1.03125,12.657518320180383]
[null,null,null,null,null,null,11,1.1343749999999999,13.92327015219842]
[null,null,null,null,null,null,12,1.2374999999999998,15.189021984216456]
[null,null,null,null,null,null,13,1.340625,16.4547738162345]
[null,null,null,null,null,null,14,1.4437499999999999,17.720525648252536]
[null,null,null,null,null,null,15,1.546875,18.986277480270576]
[null,null,null,null,null,null,16,1.65,20.252029312288613]
[null,null,null,null,null,null,17,1.7531249999999998,21.51778114430665]
[null,null,null,null,null,null,18,1.85625,22.78353297632469]
[null,null,null,null,null,null,19,1.9593749999999999,24.04928480834273]
[null,null,null,null,null,null,20,2.0625,25.315036640360766]
[null,null,null,null,null,null,21,2.1656249999999999,26.580788472378806]
[null,null,null,null,null,null,22,2.2687499999999998,27.846540304396839]
[null,null,null,null,null,null,23,2.3718749999999997,29.112292136414879]
[null,null,null,null,null,null,24,2.4749999999999996,30.378043968432912]
[null,null,null,null,null,null,25,2.578125,31.64379580045096]
[null,null,null,null,null,null,26,2.6812499999999999,32.909547632469]
[null,null,null,null,null,null,27,2.7843749999999998,34.175299464487033]
[null,null,null,null,null,null,28,2.8874999999999997,35.441051296505073]
[null,null,null,null,null,null,29,2.9906249999999996,36.706803128523106]
[null,null,null,null,null,null,30,3.09375,37.972554960541153]
[null,null,null,null,null,null,31,3.1968749999999999,39.238306792559186]

{"sheet":"WakeIn","index":5,"n_rows":34,"n_cols":4,"rows_kept":34,"cut":false,"hidden":false,"merged":[]}
["Signal","Value","Units","Notes"]
["Battery",36,"v"]
["R34",9760,"ohm","Parallel resistors to handle the power"]
["R35",{"$f":"B3","v":9760},"ohm"]
["R3",{"$f":"B4","v":9760},"ohm"]
[{"$f":"\"Current \" &A3","v":"Current R34"},{"$f":"$B$2/B3","v":3.6885245901639345E-3},"A"]
[{"$f":"\"Current \" &A4","v":"Current R35"},{"$f":"$B$2/B4","v":3.6885245901639345E-3},"A"]
["Current R3",{"$f":"$B$2/B5","v":3.6885245901639345E-3},"A"]
[{"$f":"\"Power \" &A3","v":"Power R34"},{"$f":"$B$2*B6","v":0.13278688524590165},"W","0.25W components"]
[{"$f":"\"Power \" &A4","v":"Power R35"},{"$f":"$B$2*B7","v":0.13278688524590165},"W"]
["Power R3",{"$f":"$B$2*B8","v":0.13278688524590165},"W"]
[]
["Battery (low)",12,"v"]
["Load",{"$f":"1/(1/B3+1/B4+1/B5)","v":3253.3333333333335},"ohm"]
["WakeIn current",{"$f":"B13/B14","v":3.6885245901639341E-3},"a"]
[]
["Battery (low)",28,"v"]
["Load",{"$f":"1/(1/B3+1/B4+1/B5)","v":3253.3333333333335},"ohm"]
["WakeIn current",{"$f":"B17/B18","v":8.6065573770491791E-3},"a"]
["Power",{"$f":"B17^2/B3","v":8.0327868852459017E-2}]
[]
[]
["R16 Nearest 1%",{"$f":"Resistor(B3)","v":9760},"ohm"]
["R20 Nearest 1%",{"$f":"Resistor(B4)","v":9760},"ohm"]
[]
[]
[]
[]
[]
[]
[]
[]
[]
[null,null,null,"JD Requirement - 4 mA @ 12v for contact cleaning"]

{"sheet":"WakeOut","index":6,"n_rows":24,"n_cols":22,"rows_kept":24,"cut":false,"hidden":false,"merged":[]}
["Subsystem","Manufacturer","Part Number","Qty","Designator","Description","Package","T-storage","Est. Cost","Qty","$ Ext.","Source","Length","Width","Height","Depth","Units","Length","Width","Height","Depth","Units"]
[]
["Wake Out","Infineon","BSP452",{"$f":"1+LEN(E3)-LEN(SUBSTITUTE(E3,\",\",\"\"))","v":1},"IC6","High side switch","SOT-223",null,1.4280999999999999,100,{"$f":"D3*I3","v":1.4280999999999999},"Digi-Key",6.5,7,1.7,null,"mm",{"$f":"IF(AND($Q3<>\"\",M3<>\"\"),M3*VLOOKUP($Q3,$A$67:$B$69,2),\"\")","v":{"$error":"#N/A"}},{"$f":"IF(AND($Q3<>\"\",N3<>\"\"),N3*VLOOKUP($Q3,$A$67:$B$69,2),\"\")","v":{"$error":"#N/A"}},{"$f":"IF(AND($Q3<>\"\",O3<>\"\"),O3*VLOOKUP($Q3,$A$67:$B$69,2),\"\")","v":{"$error":"#N/A"}},{"$f":"IF(AND($Q3<>\"\",P3<>\"\"),P3*VLOOKUP($Q3,$A$67:$B$69,2),\"\")","v":""},{"$f":"IF(Q3<>\"\",IF(Q3=$A$69,$A$68,$A$69),\"\")","v":0}]
[]
["Wake Out","Infineon","BTS4140N",{"$f":"1+LEN(E5)-LEN(SUBSTITUTE(E5,\",\",\"\"))","v":1},"IC6","high side driver","SOT-223",null,0.93440000000000001,100,{"$f":"D5*I5","v":0.93440000000000001},"Digi-Key"]
["Wake Out","Infineon","BSS123 L6327",{"$f":"1+LEN(E6)-LEN(SUBSTITUTE(E6,\",\",\"\"))","v":1},null,"N-channel mosfet","SOT-23",null,0.1512,100,{"$f":"D6*I6","v":0.1512},"Digi-Key"]
[]
[]
[]
[]
[]
[]
[]
[]
[]
[]
[]
[]
[]
[]
[]
["Vout",{"$f":"1.242*(B24/B23+1)","v":11.854025316455695}]
["R1",{"$f":"Resistor(15800)","v":15800}]
["R2",135000]

{"sheet":"LED Backlight","index":7,"n_rows":35,"n_cols":5,"rows_kept":35,"cut":false,"hidden":false,"merged":[]}
["LED Load Description","Value","Units",null,"Notes"]
["LED Voltage Drop max",3.1,"v"]
["LED Voltage Drop min",2.7,"v"]
["LED Max Current (at 3.1v)",5.0000000000000001E-3,"A"]
["# LEDs in Series",2,"pc"]
["# Parallel strings",2,"count"]
["Voltage - Minimum",12,"v"]
[]
["Resistance - Series",{"$f":"Resistor((B7-B5*B2)/B4)","v":1150},"ohm"]
["LED Max Current (at 2.7v)",{"$f":"(B7-B5*B3)/B9","v":5.7391304347826086E-3},"A"]
["Keypad Current at Vmin",{"$f":"B$6*(B7-B$5*B$2)/B$9","v":1.008695652173913E-2},"A"]
["Keypad Current at LED min V",{"$f":"B6*B10","v":1.1478260869565217E-2},"A"]
["Current Limit Power Diss",{"$f":"(B7-B3)*B10","v":5.3373913043478265E-2},"W"]
[]
["LED Driver","Value","Units"]
["Q2 collector current",{"$f":"B12","v":1.1478260869565217E-2},"A"]
["Q2 DC current gain",72,"hFE"]
["Q2 Base Drive",{"$f":"B16/B17","v":1.5942028985507247E-4},"A"]
["Q2 Vbe",0.6,"v"]
["Port Pin Vout High",3.1,"v"]
["R Base Drive resistor",{"$f":"(B20-B19)/B18","v":15681.818181818182},"ohm"]
["Nearest 1% value",{"$f":"Resistor((B21))","v":15800},"ohm"]
["R Power dissipation",{"$f":"(B20-B19)*B18","v":3.9855072463768114E-4},"W"]
[]
[]
[]
[]
[]
["Development LEDs","Value","Units"]
["LED Drive voltage",3.3,"v"]
["LED voltage drop max",2.4,"v"]
["LED drive current",5.0000000000000001E-3,"A"]
["Series Resistor",{"$f":"(B30-B31)/B32","v":179.99999999999997},"ohm"]
["Nearest 1% value",{"$f":"Resistor(B33)","v":178},"ohm"]
["Resistor Power dissipation",{"$f":"(B30-B31)*B32","v":4.4999999999999997E-3},"W"]

{"sheet":"Prog","index":8,"n_rows":4,"n_cols":3,"rows_kept":4,"cut":false,"hidden":false,"merged":[]}
["Reset protection","Value","Units"]
["Series Resistor",100,"ohm"]
["Max voltage diff",5,"v"]
["Resistor Power Diss",{"$f":"B3^2/B2","v":0.25},"W"]

{"sheet":"12v Power","index":9,"n_rows":23,"n_cols":8,"rows_kept":23,"cut":false,"hidden":false,"merged":[]}
["Signal","Value","Units","Notes",null,"Value","Units","Notes"]
["V-IN",28,"v",null,null,34,"v","Controlled shutdown"]
["V-OUT",12,"v",null,null,12,"v"]
["R1",{"$f":"Resistor(B5*(B3/1.193-1))","v":143000},"ohm"]
["R2",{"$f":"Resistor(15800)","v":15800},"ohm"]
["Current - R1,R2",{"$f":"B3/(B4+B5) *1000","v":7.5566750629722915E-2},"mA"]
[]
["12v Loads","Value","Units","Notes",null,"Value","Units","Notes"]
["Quiescient Current",2.5000000000000001E-2,"mA",null,null,2.5000000000000001E-2,"mA"]
["LIN",{"$f":"1000*'LIN Xcvr'!B12","v":17},"mA","27 mA as master",null,0.03,"mA","No transmit"]
["Acoustic Signal",5,"mA",null,null,0,"mA","Signal Off"]
["Backlight LEDs",{"$f":"1000*'LED Backlight'!B16","v":11.478260869565217},"mA","from LED Sheet",null,{"$f":"0.5*B12","v":5.7391304347826084},"mA"]
["3.3v Supply",{"$f":"'3.3v Power'!B38","v":21.514891352549892},"mA","from 3.3v Power sheet",null,{"$f":"'3.3v Power'!E38","v":5.1898891352549885},"mA","Includes all loads"]
["Total",{"$f":"SUM(B9:B13)","v":55.018152222115106},"mA",null,null,{"$f":"SUM(F9:F13)","v":10.984019570037596},"mA"]
[]
["Operating Junction Limit",125,"°C","Component Limit"]
["Power Dissipation",{"$f":"(B2-B3)*B14/1000","v":0.88029043555384168},"W",null,null,{"$f":"(F2-F3)*F14/1000","v":0.24164843054082713},"W"]
[]
["Temp Junct to Board",34,"°C / W",null,null,34,"°C / W"]
[]
["Temp Rise",{"$f":"B17*B19","v":29.929874808830618},"°C",null,null,{"$f":"F17*F19","v":8.2160466383881232},"°C"]
["Ambient",85,"°C",null,null,85,"°C"]
["Junction Temp",{"$f":"SUM(B21:B22)","v":114.92987480883062},"°C",null,null,{"$f":"SUM(F21:F22)","v":93.216046638388121},"°C"]

{"sheet":"3.3v Power","index":10,"n_rows":38,"n_cols":7,"rows_kept":38,"cut":false,"hidden":false,"merged":[]}
["Description","Value","Units","Notes"]
["LM2936DT-3.3",3.3,"v","regulated output voltage, 50 mA max. -50, +60"]
[]
["V Battery min",9,"v"]
["V Battery max operating",32,"v","max operating (does not subtract reverse diode"]
["V Battery max",36,"v","auto-sleep"]
[]
["I Load min",0.5,"mA"]
["I Load max operating",{"$f":"B31","v":10},"mA","Average current"]
["I Load max",2,"mA"]
[]
["Power dissipation min",{"$f":"(B4-$B$2)*B8","v":2.85},"mW"]
["Power dissipation max oper.",{"$f":"(B5-$B$2)*B9","v":287},"mW","max operating"]
["Power dissipation max",{"$f":"(B6-$B$2)*B10","v":65.400000000000006},"mW","Linear regulator dissipation"]
[]
["Ambient temp nominal",25,"°C"]
["Ambient temp max",85,"°C"]
["Temp Rise J-A",140,"°C / W","Component spec"]
["Calc. Temp Rise",{"$f":"B18*B13/1000","v":40.18},"°C"]
["Calc. Temp max oper",{"$f":"B17+B19","v":125.18},"°C","Spec is 150°C, with power diss internally limited"]
[]
["Diode Drop",1,"v","Reverse Protection"]
["Current",0.05,"A"]
["Diode Power",{"$f":"1000*B22*B23","v":50},"mW"]
[]
["Development LED Voltage",1.6,"v"]
["Target Current",5,"mA"]
["Nearest 1% resistor",{"$f":"Resistor((B2-B26)/(B27/1000))","v":340},"ohm"]
[]
["Current Requirements","Value","Units","Notes","Value","Units","Notes"]
["PIC",10,"mA","Cranking hard",4,"mA","gentle snooze"]
["LED Driver",{"$f":"1000*(B2-0.6)/2050","v":1.3170731707317072},"mA","100% on",{"$f":"0.1 *1000*(B2-0.6)/2050","v":0.13170731707317074},"mA","10% on"]
["Acoustic Driver",{"$f":"1000*(B2-0.6)/33000","v":8.1818181818181804E-2},"mA","100% on",{"$f":"0.1 * 1000*(B2-0.6)/33000","v":8.1818181818181825E-3},"mA","10% on"]
["Test Point LEDs (2)",{"$f":"2*B27","v":10},"mA","both on",{"$f":"0.1 * 2*B27","v":1},"mA","10% on"]
["HV Enable",{"$f":"1000*B2/100000","v":3.3000000000000002E-2},"mA","hv on",{"$f":"1000*E2/100000","v":0},"mA","hv off"]
["Quiescient Current",0.05,"mA","regulator internal",0.05,"mA","regulator internal"]
["LIN RxD",{"$f":"1000*B2/100000","v":3.3000000000000002E-2},"mA","normal",{"$f":"1000*E2/100000","v":0},"mA","sleep"]
["Total",{"$f":"SUM(B31:B37)","v":21.514891352549892},"mA",null,{"$f":"SUM(E31:E37)","v":5.1898891352549885},"mA"]

{"sheet":"Motor","index":11,"n_rows":29,"n_cols":4,"rows_kept":29,"cut":false,"hidden":false,"merged":[]}
["Description","Value","Units","Notes"]
["Min Voltage",9,"V","Assumes the motor is rated to operate at this minimum voltage"]
["Motor Current @Min V",5,"A","And current"]
["Power Min",{"$f":"B2*B3","v":45},"W"]
[]
["Voltage 1",12,"V"]
["Motor Current @V1",{"$f":"B$3 * B6/B$2","v":6.666666666666667},"A"]
["Power 1",{"$f":"B6*B7","v":80},"W"]
[]
["Voltage 2",24,"V"]
["Motor Current @V2",{"$f":"B$3 * B10/B$2","v":13.333333333333334},"A"]
["Power 2",{"$f":"B10*B11","v":320},"W"]
[]
["Voltage 2",32,"V"]
["Motor Current @V2",{"$f":"B$3 * B14/B$2","v":17.777777777777779},"A"]
["Power 3",{"$f":"B14*B15","v":568.88888888888891},"W"]
[]
["Error Flag Behavior","Value","Units","Description"]
["Vcc",3.3,"v"]
["EF leakage",10,"uA"]
["Nominal equiv R",{"$f":"B19/(B20*0.000001)","v":330000},"ohm"]
["Pullup",{"$f":"Resistor(75000)","v":75000},"ohm"]
["EF V leakage",{"$f":"B19*B21/(B22+B21)","v":2.6888888888888891},"bill25"]
[]
["PIC Input High (TTL)",2,"v"]
["PIC Input High (TTL2)",{"$f":"0.8+0.25*B19","v":1.625},"v"]
["PIC Input High (Schmitt)",{"$f":"0.8*B19","v":2.64},"v"]
["PIC Input High (I2C)",{"$f":"0.7*B19","v":2.3099999999999996},"v"]
["PIC Input High (SMBus)",2.1,"v"]

{"sheet":"LIN Xcvr","index":12,"n_rows":18,"n_cols":3,"rows_kept":18,"cut":false,"hidden":false,"merged":[]}
["Vendor","Part #","LIN V"]
["Infineon","TLE7259-2GE",2]
[]
[]
["LIN Master","Value","Units"]
["LIN MASTER",1,"True/False"]
["Vsupply",12,"v"]
["Resistor",{"$f":"IF(B6,1000,1000000)","v":1000},"ohm"]
["Current - short crkt",{"$f":"B7/B8","v":1.2E-2},"A"]
["Power Dis",{"$f":"(B7-0.6)*B9","v":0.1368},"W"]
["Chip Oper Cur",5.0000000000000001E-3,"A"]
["Total Current",{"$f":"B7/B8+B11","v":1.7000000000000001E-2},"A"]
[]
["LIN Master","Value","Units"]
["Nuber Resistors",2,"count"]
["Resistance",{"$f":"B15*B8","v":2000},"ohm"]
["Current - short",{"$f":"B7/B16","v":6.0000000000000001E-3},"A"]
["Power",{"$f":"B7*B17","v":7.2000000000000008E-2},"W"]

{"sheet":"Ribbon Con","index":13,"n_rows":30,"n_cols":4,"rows_kept":30,"cut":false,"hidden":false,"merged":[]}
["Pin","X","Y","Units"]
[1,{"$f":"-2.5-1.25/2","v":-3.125},1,"mm"]
[2,{"$f":"(A3-A$2)*1.25+B$2","v":-1.875},{"$f":"C2-2","v":-1},"mm"]
[3,{"$f":"(A4-A$2)*1.25+B$2","v":-0.625},{"$f":"C2","v":1},"mm"]
[4,{"$f":"(A5-A$2)*1.25+B$2","v":0.625},{"$f":"C3","v":-1},"mm"]
[5,{"$f":"(A6-A$2)*1.25+B$2","v":1.875},{"$f":"C4","v":1},"mm"]
[6,{"$f":"(A7-A$2)*1.25+B$2","v":3.125},{"$f":"C5","v":-1},"mm"]
[]
["Housing Left",{"$f":"-13.25/2","v":-6.625}]
["Housing Right",{"$f":"-B9","v":6.625}]
["Slot Left",{"$f":"-8.95/2","v":-4.4749999999999996}]
["Slot Right",{"$f":"-B11","v":4.4749999999999996}]
[]
[]
[]
["Pin","X","Y","Units"]
[1,-1.25,1,"mm"]
[2,{"$f":"(A18-A$17)*1.25+B$17","v":0},{"$f":"C17-2","v":-1},"mm"]
[3,{"$f":"(A19-A$17)*1.25+B$17","v":1.25},{"$f":"C17","v":1},"mm"]
[]
[]
["Housing Left",{"$f":"-9.5/2","v":-4.75}]
["Housing Right",{"$f":"-B22","v":4.75}]
["Slot Left",{"$f":"-5.2/2","v":-2.6}]
["Slot Right",{"$f":"-B24","v":2.6}]
[]
[null,84.86,"mm"]
[null,{"$f":"B27/25.4","v":3.3409448818897638}]
[null,21.79,"mm"]
[null,{"$f":"B29/25.4","v":0.85787401574803146}]

{"sheet":"Block Cost","index":14,"n_rows":27,"n_cols":5,"rows_kept":27,"cut":false,"hidden":false,"merged":[]}
["Functional Block","Est. Cost","Qty",null,"Notes"]
["Micro",4.5,2000,null,"micro, crystal, caps"]
["Config Storage",0.25,2000,null,"eerom"]
["Power Supply",4,2000,null,"switching"]
["Learn Mode",0.1,2000,null,"2xR, 1xC"]
["Wakeup In",0.25,2000]
["Wakeup Out",1,2000]
["LIN Transceiver",1,2000]
["CAN Transceiver",1,2000,null,"xcvr, filter, diodes"]
["H-Driver",3.75,2000]
["LED Driver",0.1,2000]
["Keypad Sense",0.25,2000]
["Acoustic Signal",2.25,2000,null,"need to find -40 to +85 part"]
["Miscellaneous",3,2000,null,"whatever was forgotton above"]
["Estimated Total",{"$f":"SUM(B2:B14)","v":21.45}]
[]
[]
[]
["Estimated costs includes the primary and supporting components"]
[]
[]
[]
[]
[null,"LIN","CAN","JD Exclusive","Description"]
[null,"Yes","No","No","smaller micro, no JD/OS"]
[null,"No","Yes","Yes","JD/OS, \"fully integrated\""]
[null,"No","Yes","No","powerful micro, ~25-50,000 lines of code"]

{"sheet":"Acoustic","index":15,"n_rows":20,"n_cols":6,"rows_kept":20,"cut":false,"hidden":false,"merged":[]}
["Acoustic Signal"]
["4khz - http://www.soundsnap.com/search/audio/4khz/popular"]
["2khz - http://www.soundsnap.com/search/audio/2khz/popular"]
[]
["Manufacturer","Freq","Temp Range","$ ea","$ @500","Web"]
[]
["CUI Inc (smd)","4 khz","'-30 + 70","$4.81 qty 1","$2.49 qty 500","http://search.digikey.com/us/en/products/CMI-1240/102-1196-5-ND/504829"]
["CUI Inc (thru hole)","4 khz","'-20 +70","$3.19 qty 1","$1.65 qty 500","http://search.digikey.com/us/en/products/CEP-2242/102-1115-ND/412374"]
["PUI Audio (thru hole)","4 khz","'-20 +70","$3.66 qty 1","$2.20 qty 500","http://search.digikey.com/us/en/products/AI-1440-TWT-12V-R/668-1024-ND/1464763"]
["Mallory (thru hole)","4.1 khz","'-20 + 90","$2.43 qty 1","$2.09 qty 500","http://search.digikey.com/us/en/products/PK-12N40PQ/458-1066-ND/969793"]
["Kobiton (thru hole)","4 khz","'-20 + 105","$4.26 qty 1","$2.59 qty 500","http://www.mouser.com/ProductDetail/Kobitone/254-15210-ROX/?qs=05UEgX2TgG1gFl%2faATOCEw%3d%3d"]
[]
[]
[]
["Acoustic Supply",12,"v"]
["Acoustic Current",5.0000000000000001E-3,"A"]
["Driver gain (min)",50]
["Base Drive Current",{"$f":"B16/B17","v":1E-4},"A"]
["Base Drive Voltage",3.3,"v"]
["Base Drive Resistance",{"$f":"B19/B18","v":33000}]

{"sheet":"Components","index":16,"n_rows":46,"n_cols":4,"rows_kept":46,"cut":false,"hidden":false,"merged":[]}
["Category","ScratchNotes","Additional Notes"]
["H-Bridge","BTN7960/70/71","half-Bridge 40V 40A","requires 2 part"]
["H-Bridge","TLE6208-3","3 half-bridge .8A 32v","0.8A not enough"]
["H-Bridge","TLE8201R","Full Door module - Mirror w/heat/light","too many functions - cost"]
["H-Bridge","TLE8203E","Full Door module - Mirror w/heat/light","not enough current"]
["H-Bridge","TLE84106EL","Hex half-bridge","18v, 0.8A"]
["H-Bridge","TLE7181EM","H-Bridge Driver: 34v, 10 uA quiescient, lots of features (may cost too much)","Pre-Driver for mosfets"]
["H-Bridge","BTM7740G","8A peak (25C), 5uA quiesc, 40V"]
["H-Bridge","TLE5205","4A 40V status"]
["H-Bridge","TLE5206","4A 40V status"]
[]
[null,"BTS50015","Single high-side 28V 33A, 18uA standby","If we need a pre-enable"]
[]
["System Basis Chip","TLE8261E","System Basis Chip, reg, CAN transceiver, watchdog","very interesting combination of parts, but for a system that does not need them all, this is overkill and no alternate sourcing."]
["System Basis Chip","TLE8262E","1xLIN"]
["System Basis Chip","TLE8263E","2xLIN"]
["System Basis Chip","TLE8264E","3xLIN"]
["System Basis Chip","TLE6266G","CAN, Watchdog","on special request only"]
["Window Lift Module","TLE7810","Full Window Control on LIN w/8051"]
[]
[]
["Power Supply","TLE6365G","step down w/reset 8 to 40v","no enable"]
["Power Supply","TLE6711G","boost/buck, watchdog, enable","watchdog compatibility"]
["Power Supply","TLE7368E","5.5v, reset, watchdog","overkill - for high end multi-voltage"]
["Power Supply","TLE4278G","Reset, watchdog","linear part, but with possibly adequate heat-sink"]
["Power Supply","LTC3115-1","buck-boost, 2.7-40v, 5v1A out, enable, burst mode"]
["Power Supply","LT3433","buck-boost, 4-60v, 5v .3A, enable"]
["Power Supply","LT3689","step-down, por, wdt","wdt compatibility?"]
["Power Supply","LT3682","uPower step down,"]
["Power Supply","LT3631","4.5 to 45 to 5v@100mA","nice, but 100mA max"]
["Power Supply","LT3470A","buck reg 12v to 5v@250mA","8-pin"]
["Power Supply","LTM8021","7.5-36v to 5v@500mA","full uModule w most parts (LGA pkg)"]
["Power Supply","LT3502","7-40v to 5v@500mA"]
["Power Supply","LT3970","7-40 to 5v@350mA, enable, power good out","10-pin"]
["Power Supply","LT1934ES6","6.5-34v to 5v@250mA, enable","6-pin"]
[]
[]
[]
["Capacitive Touch Sense",null,"Can share matrix with backlight LEDs"]
[]
[]
["Key","Not yet analyzed","part identified from initial scan/research"]
[null,"Candidate Parts","looks even better"]
[null,"Candidate Parts","seems to mee the requirements"]
[null,"Defer rejection","further analysis may be required"]
[null,"Rejected","not appropriate for this project (reason noted)"]